{"text_format":"1","workbook":"xlsx","n_sheets":8,"sheets":["Series Winners","Series Table","Torpantau","Preseli Beast","Cwmdu","Pen Y Fan","Fan Brycheiniog","Llyn Y Fan"],"not_rendered":{"charts":0,"images":1,"macros":1,"external_links":1,"defined_names":59,"comments":0,"pivot_tables":0},"unopened":[],"bounds":{"document_bytes":16777216,"sheet_cells":100000,"rows_first":2000,"rows_last":500,"rows_between":2000,"halvings":0,"cell_chars":16384,"cell_head_chars":4096},"cells_cut":0,"cells_raw":0,"read":"whole","date_system":"1900"}

{"sheet":"Series Winners","index":0,"n_rows":23,"n_cols":6,"rows_kept":23,"cut":false,"hidden":false,"merged":[]}
[]
[null,"MU40",null,null,null,"FU40"]
[]
[null,"Name","Club","Point","Races completed","Name"]
[]
[]
[]
[]
[null,"MO40",null,null,null,"FO40"]
[]
[]
[]
[]
[]
[null,"M050"]
[]
[]
[]
[null,"MO60"]
[]
[]
[]
[null,"MO70"]

{"sheet":"Series Table","index":1,"n_rows":297,"n_cols":22,"rows_kept":297,"cut":false,"hidden":false,"merged":[[0,16,0,17],[0,6,0,7],[0,8,0,9],[0,10,0,11],[0,12,0,13],[0,14,0,15]]}
[null,"2017 Summer Series",null,null,null,null,"Torpantau",null,"Preseli Beast",null,"Cwmdu",null,"Pen Y Fan",null,"Fan Brycheiniog",null,"Llyn Y Fan "]
["Pos","Name","Club","Gender","Cat.","Total","Time","Score","Time","Score","Time","Score","Time","Score","Time","Score","Time","Score","Competed","Ave (Best of 4)",null,"WFRA membership as of March 2017"]
[{"$f":"ROW(A1)","v":1},"Dan Doherty",{"$f":"IFERROR(VLOOKUP(B3,INDIRECT(\"'\"&$M$1&\"'!\"&\"$C$2:$H$200\"),2,FALSE),\"\")","v":"Mynydd Du"},{"$f":"IFERROR(VLOOKUP(B3,INDIRECT(\"'\"&$M$1&\"'!\"&\"$C$2:$H$200\"),3,FALSE),\"\")","v":"M"},{"$f":"IFERROR(VLOOKUP(B3,INDIRECT(\"'\"&$M$1&\"'!\"&\"$C$2:$H$200\"),4,FALSE),\"\")","v":"M"},{"$f":"SUM(LARGE((H3,J3,L3,N3,P3,R3),{1,2,3,4}))","v":517.00595597322217},{"$f":"IFERROR(VLOOKUP(B3,INDIRECT(\"'\"&$G$1&\"'!\"&\"$C$2:$H$200\"),5,FALSE),\"\")","v":"01:03:35"},{"$f":"IFERROR(VLOOKUP(B3,INDIRECT(\"'\"&$G$1&\"'!\"&\"$C$2:$H$200\"),6,FALSE),0)","v":128.48886250741981},{"$f":"IFERROR(VLOOKUP(B3,INDIRECT(\"'\"&$I$1&\"'!\"&\"$C$2:$G$200\"),5,FALSE),\"\")","v":0.12887731481481482},{"$f":"IFERROR(VLOOKUP(B3,INDIRECT(\"'\"&$I$1&\"'!\"&\"$C$2:$H$200\"),6,FALSE),0)","v":132.80267461648944},{"$f":"IFERROR(VLOOKUP(B3,INDIRECT(\"'\"&$K$1&\"'!\"&\"$C$2:$H$200\"),5,FALSE),\"\")","v":""},{"$f":"IFERROR(VLOOKUP(B3,INDIRECT(\"'\"&$K$1&\"'!\"&\"$C$2:$H$200\"),6,FALSE),0)","v":0},{"$f":"IFERROR(VLOOKUP(B3,INDIRECT(\"'\"&$M$1&\"'!\"&\"$C$2:$h$200\"),5,FALSE),\"\")","v":2.5370370370370366E-2},{"$f":"IFERROR(VLOOKUP(B3,INDIRECT(\"'\"&$M$1&\"'!\"&\"$C$2:$h$200\"),6,FALSE),0)","v":127.99737216686742},{"$f":"IFERROR(VLOOKUP(B3,INDIRECT(\"'\"&$O$1&\"'!\"&\"$C$2:$h$200\"),5,FALSE),\"\")","v":5.2532291666666668E-2},{"$f":"IFERROR(VLOOKUP(B3,INDIRECT(\"'\"&$O$1&\"'!\"&\"$C$2:$h$200\"),6,FALSE),0)","v":127.71704668244541},{"$f":"IFERROR(VLOOKUP(B3,INDIRECT(\"'\"&$Q$1&\"'!\"&\"$C$2:$h$200\"),5,FALSE),\"\")","v":""},{"$f":"IFERROR(VLOOKUP(B3,INDIRECT(\"'\"&$Q$1&\"'!\"&\"$C$2:$h$200\"),6,FALSE),0)","v":0},{"$f":"6-COUNTIF(G3:Q3,\"\")","v":4},{"$f":"F3/IF(S3>4,4,S3)","v":129.25148899330554},null,{"$f":"COUNTIF(#REF!,'Series Table'!B3)>0","v":{"$error":"#REF!"}}]
[{"$f":"ROW(A2)","v":2},"Jez Brown",{"$f":"IFERROR(VLOOKUP(B4,INDIRECT(\"'\"&$M$1&\"'!\"&\"$C$2:$H$200\"),2,FALSE),\"\")","v":"Buckley Runners"},{"$f":"IFERROR(VLOOKUP(B4,INDIRECT(\"'\"&$M$1&\"'!\"&\"$C$2:$H$200\"),3,FALSE),\"\")","v":"M"},{"$f":"IFERROR(VLOOKUP(B4,INDIRECT(\"'\"&$M$1&\"'!\"&\"$C$2:$H$200\"),4,FALSE),\"\")","v":"M40"},{"$f":"SUM(LARGE((H4,J4,L4,N4,P4,R4),{1,2,3,4}))","v":487.87741103905296},"",0,0.12930555555555556,132.57938759006916,"01:24:43",119.44277156169767,2.6921296296296294E-2,123.59575166976899,6.3766203703703714E-2,112.25950021751716,"",0,4,121.96935275976324,null,{"$f":"COUNTIF(#REF!,'Series Table'!B4)>0","v":{"$error":"#REF!"}}]
[3,"Andy Pritchard",{"$f":"IFERROR(VLOOKUP(B5,INDIRECT(\"'\"&$G$1&\"'!\"&\"$C$2:$H$200\"),2,FALSE),\"\")","v":"Buckley Runners"},{"$f":"IFERROR(VLOOKUP(B5,INDIRECT(\"'\"&$G$1&\"'!\"&\"$C$2:$H$200\"),3,FALSE),\"\")","v":"M"},{"$f":"IFERROR(VLOOKUP(B5,INDIRECT(\"'\"&$G$1&\"'!\"&\"$C$2:$H$200\"),4,FALSE),\"\")","v":"M40"},{"$f":"SUM(LARGE((H5,J5,L5,N5,P5,R5),{1,2,3,4}))","v":438.67122208440742},"01:20:18",109.6879002780468,0.17152777777777775,110.56449374192849,"01:34:01",110.59938508352087,"",0,6.6993055555555556E-2,107.8194429809113,"",0,4,109.66780552110185,null,{"$f":"COUNTIF(#REF!,'Series Table'!B5)>0","v":{"$error":"#REF!"}}]
[4,"Hayley Evans",{"$f":"IFERROR(VLOOKUP(B6,INDIRECT(\"'\"&$M$1&\"'!\"&\"$C$2:$H$200\"),2,FALSE),\"\")","v":"Buckley Runners"},{"$f":"IFERROR(VLOOKUP(B6,INDIRECT(\"'\"&$M$1&\"'!\"&\"$C$2:$H$200\"),3,FALSE),\"\")","v":"F"},{"$f":"IFERROR(VLOOKUP(B6,INDIRECT(\"'\"&$M$1&\"'!\"&\"$C$2:$H$200\"),4,FALSE),\"\")","v":"F"},{"$f":"SUM(LARGE((H6,J6,L6,N6,P6,R6),{1,2,3,4}))","v":438.55514831999699},"01:22:44",106.95116998344218,0.1618287037037037,115.6216431511231,"01:36:29",108.25382737963167,3.2893518518518523E-2,106.64622796452426,6.7059143518518521E-2,107.72850780580005,"",0,5,109.63878707999925,null,{"$f":"COUNTIF(#REF!,'Series Table'!B6)>0","v":{"$error":"#REF!"}}]
[5,"Rhian Probert","Mynydd Du","F","F40",{"$f":"SUM(LARGE((H7,J7,L7,N7,P7,R7),{1,2,3,4}))","v":414.38876240987281},"",0,0.18469907407407407,103.69690898338023,"01:42:06",102.91292909442456,3.412037037037037E-2,103.16434906383445,6.9322222222222216E-2,104.61457526823357,"",0,4,103.5971906024682,null,{"$f":"COUNTIF(#REF!,'Series Table'!B7)>0","v":{"$error":"#REF!"}}]
[6,"Rona Davies","Mynydd Du","F","F50",{"$f":"SUM(LARGE((H8,J8,L8,N8,P8,R8),{1,2,3,4}))","v":388.68404729351812},"01:30:10",98.591021275266357,0.18869212962962964,101.61490833162348,"01:53:15",92.310374338330845,3.6585648148148145E-2,96.167743348297407,8.0607060185185181E-2,89.086956163990166,"",0,5,97.17101182337953,null,{"$f":"COUNTIF(#REF!,'Series Table'!B8)>0","v":{"$error":"#REF!"}}]
[7,"Sasha Habgood","MDC","F","F40",{"$f":"SUM(LARGE((H9,J9,L9,N9,P9,R9),{1,2,3,4}))","v":373.35141880707465},"01:35:28",92.630197756880889,0.21215277777777777,89.382400154490483,"01:57:16",88.49091888807888,3.8402777777777779E-2,91.010620825577575,7.243738425925926E-2,100.32820007012573,"",0,5,93.337854701768663,null,{"$f":"COUNTIF(#REF!,'Series Table'!B9)>0","v":{"$error":"#REF!"}}]
[8,"Mark Lunt","Westbury Harriers","M","M",{"$f":"SUM(LARGE((H10,J10,L10,N10,P10,R10),{1,2,3,4}))","v":343.01471197581736},"01:14:06",116.66093911087509,"",0,"01:32:23",112.15252464420425,3.0231481481481481E-2,114.20124822073801,"",0,"",0,3,114.33823732527246,null,{"$f":"COUNTIF(#REF!,'Series Table'!B10)>0","v":{"$error":"#REF!"}}]
[9,"David York","Tattenhall Runners","M","M50",{"$f":"SUM(LARGE((H11,J11,L11,N11,P11,R11),{1,2,3,4}))","v":341.95974184048396},"01:39:15",88.375144490612016,"",0,"02:02:38",83.387746045833453,4.2280092592592598E-2,80.006569582831503,7.9805208333333336E-2,90.190281721207,"",0,4,85.489935460120989,null,{"$f":"COUNTIF(#REF!,'Series Table'!B11)>0","v":{"$error":"#REF!"}}]
[10,"Daniel Lewis",{"$f":"IFERROR(VLOOKUP(B12,INDIRECT(\"'\"&$I$1&\"'!\"&\"$C$2:$H$200\"),2,FALSE),\"\")","v":"Wye Valley Runners"},{"$f":"IFERROR(VLOOKUP(B12,INDIRECT(\"'\"&$I$1&\"'!\"&\"$C$2:$H$200\"),3,FALSE),\"\")","v":"M"},{"$f":"IFERROR(VLOOKUP(B12,INDIRECT(\"'\"&$I$1&\"'!\"&\"$C$2:$H$200\"),4,FALSE),\"\")","v":"M40"},{"$f":"SUM(LARGE((H12,J12,L12,N12,P12,R12),{1,2,3,4}))","v":339.37680650931657},"01:20:17",109.70664500609205,0.15630787037037039,118.50023535659543,"01:33:25",111.16992614662907,"",0,"",0,"",0,3,113.12560216977219,null,{"$f":"COUNTIF(#REF!,'Series Table'!B12)>0","v":{"$error":"#REF!"}}]
[11,"John Aggleton",{"$f":"IFERROR(VLOOKUP(B13,INDIRECT(\"'\"&$M$1&\"'!\"&\"$C$2:$H$200\"),2,FALSE),\"\")","v":"MDC"},{"$f":"IFERROR(VLOOKUP(B13,INDIRECT(\"'\"&$M$1&\"'!\"&\"$C$2:$H$200\"),3,FALSE),\"\")","v":"M"},{"$f":"IFERROR(VLOOKUP(B13,INDIRECT(\"'\"&$M$1&\"'!\"&\"$C$2:$H$200\"),4,FALSE),\"\")","v":"M60"},{"$f":"SUM(LARGE((H13,J13,L13,N13,P13,R13),{1,2,3,4}))","v":327.545838502327},"",0,0.16645833333333335,113.20772935198484,"01:38:17",106.54220419030716,3.2488425925925928E-2,107.79590496003505,"",0,"",0,3,109.18194616744233,null,{"$f":"COUNTIF(#REF!,'Series Table'!B13)>0","v":{"$error":"#REF!"}}]
[12,"Paul Tucker",{"$f":"IFERROR(VLOOKUP(B14,INDIRECT(\"'\"&$M$1&\"'!\"&\"$C$2:$H$200\"),2,FALSE),\"\")","v":"Mynydd Du"},{"$f":"IFERROR(VLOOKUP(B14,INDIRECT(\"'\"&$M$1&\"'!\"&\"$C$2:$H$200\"),3,FALSE),\"\")","v":"M"},{"$f":"IFERROR(VLOOKUP(B14,INDIRECT(\"'\"&$M$1&\"'!\"&\"$C$2:$H$200\"),4,FALSE),\"\")","v":"M50"},{"$f":"SUM(LARGE((H14,J14,L14,N14,P14,R14),{1,2,3,4}))","v":315.50339645510695},"01:21:36",108.22581149051831,0.1844675925925926,103.81760467333712,"",0,3.4016203703703708E-2,103.45998029125153,"",0,"",0,3,105.16779881836898,null,{"$f":"COUNTIF(#REF!,'Series Table'!B14)>0","v":{"$error":"#REF!"}}]
[13,"James Woodier",{"$f":"IFERROR(VLOOKUP(B15,INDIRECT(\"'\"&$G$1&\"'!\"&\"$C$2:$H$200\"),2,FALSE),\"\")","v":"Mynydd Du"},{"$f":"IFERROR(VLOOKUP(B15,INDIRECT(\"'\"&$G$1&\"'!\"&\"$C$2:$H$200\"),3,FALSE),\"\")","v":"M"},{"$f":"IFERROR(VLOOKUP(B15,INDIRECT(\"'\"&$G$1&\"'!\"&\"$C$2:$H$200\"),4,FALSE),\"\")","v":"M"},{"$f":"SUM(LARGE((H15,J15,L15,N15,P15,R15),{1,2,3,4}))","v":306.79168343416433},"01:26:54",102.26498797213286,"",0,"01:41:11",103.78458905195096,"",0,7.2136574074074075E-2,100.7421064100805,"",0,3,102.26389447805478,null,{"$f":"COUNTIF(#REF!,'Series Table'!B15)>0","v":{"$error":"#REF!"}}]
[14,"Emma McWilliams",{"$f":"IFERROR(VLOOKUP(B16,INDIRECT(\"'\"&$I$1&\"'!\"&\"$C$2:$H$200\"),2,FALSE),\"\")","v":"Mynydd Du"},{"$f":"IFERROR(VLOOKUP(B16,INDIRECT(\"'\"&$I$1&\"'!\"&\"$C$2:$H$200\"),3,FALSE),\"\")","v":"F"},{"$f":"IFERROR(VLOOKUP(B16,INDIRECT(\"'\"&$I$1&\"'!\"&\"$C$2:$H$200\"),4,FALSE),\"\")","v":"F"},{"$f":"SUM(LARGE((H16,J16,L16,N16,P16,R16),{1,2,3,4}))","v":301.45099825691551},"01:29:25",99.434534037302001,0.18961805555555555,101.13212557179585,"01:44:14",100.88433864781767,"",0,"",0,"",0,3,100.4836660856385,null,{"$f":"COUNTIF(#REF!,'Series Table'!B16)>0","v":{"$error":"#REF!"}}]
[15,"Bev Tucker",{"$f":"IFERROR(VLOOKUP(B17,INDIRECT(\"'\"&$I$1&\"'!\"&\"$C$2:$H$200\"),2,FALSE),\"\")","v":"Mynydd Du"},{"$f":"IFERROR(VLOOKUP(B17,INDIRECT(\"'\"&$I$1&\"'!\"&\"$C$2:$H$200\"),3,FALSE),\"\")","v":"F"},{"$f":"IFERROR(VLOOKUP(B17,INDIRECT(\"'\"&$I$1&\"'!\"&\"$C$2:$H$200\"),4,FALSE),\"\")","v":"F50"},{"$f":"SUM(LARGE((H17,J17,L17,N17,P17,R17),{1,2,3,4}))","v":266.81873985757619},"01:41:55",85.375988003374076,0.19494212962962965,98.356124702786857,"02:02:57",83.086627151415243,"",0,"",0,"",0,3,88.939579952525392,null,{"$f":"COUNTIF(#REF!,'Series Table'!B17)>0","v":{"$error":"#REF!"}}]
[16,"Gary Gunner",{"$f":"IFERROR(VLOOKUP(B18,INDIRECT(\"'\"&$M$1&\"'!\"&\"$C$2:$H$200\"),2,FALSE),\"\")","v":"Croft Ambrey"},{"$f":"IFERROR(VLOOKUP(B18,INDIRECT(\"'\"&$M$1&\"'!\"&\"$C$2:$H$200\"),3,FALSE),\"\")","v":"M"},{"$f":"IFERROR(VLOOKUP(B18,INDIRECT(\"'\"&$M$1&\"'!\"&\"$C$2:$H$200\"),4,FALSE),\"\")","v":"M70"},{"$f":"SUM(LARGE((H18,J18,L18,N18,P18,R18),{1,2,3,4}))","v":253.80797263881942},"",0,0.2129861111111111,88.947895670645607,"02:02:45",83.27680750578466,4.1724537037037039E-2,81.58326946238914,"",0,"",0,3,84.602657546273136,null,{"$f":"COUNTIF(#REF!,'Series Table'!B18)>0","v":{"$error":"#REF!"}}]
[17,"Samuel Gregory",{"$f":"IFERROR(VLOOKUP(B19,INDIRECT(\"'\"&$I$1&\"'!\"&\"$C$2:$H$200\"),2,FALSE),\"\")","v":"Machen"},{"$f":"IFERROR(VLOOKUP(B19,INDIRECT(\"'\"&$I$1&\"'!\"&\"$C$2:$H$200\"),3,FALSE),\"\")","v":"M"},{"$f":"IFERROR(VLOOKUP(B19,INDIRECT(\"'\"&$I$1&\"'!\"&\"$C$2:$H$200\"),4,FALSE),\"\")","v":"M"},{"$f":"SUM(LARGE((H19,J19,L19,N19,P19,R19),{1,2,3,4}))","v":243.25102309758455},"",0,0.1479513888888889,122.85734976403992,"01:23:43",120.39367333354463,"",0,"",0,"",0,2,121.62551154879228,null,{"$f":"COUNTIF(#REF!,'Series Table'!B19)>0","v":{"$error":"#REF!"}}]
[18,"Joc Dodd",{"$f":"IFERROR(VLOOKUP(B20,INDIRECT(\"'\"&$M$1&\"'!\"&\"$C$2:$H$200\"),2,FALSE),\"\")","v":"Chepstow Harriers"},{"$f":"IFERROR(VLOOKUP(B20,INDIRECT(\"'\"&$M$1&\"'!\"&\"$C$2:$H$200\"),3,FALSE),\"\")","v":"F"},{"$f":"IFERROR(VLOOKUP(B20,INDIRECT(\"'\"&$M$1&\"'!\"&\"$C$2:$H$200\"),4,FALSE),\"\")","v":"F60"},{"$f":"SUM(LARGE((H20,J20,L20,N20,P20,R20),{1,2,3,4}))","v":237.23891906295142},"01:43:04",84.082601768252687,"",0,"02:05:19",80.83615962471076,4.4988425925925925E-2,72.320157669987978,"",0,"",0,3,79.07963968765047,null,{"$f":"COUNTIF(#REF!,'Series Table'!B20)>0","v":{"$error":"#REF!"}}]
[19,"Nathan Brickman",{"$f":"IFERROR(VLOOKUP(B21,INDIRECT(\"'\"&$G$1&\"'!\"&\"$C$2:$H$200\"),2,FALSE),\"\")","v":"Belpher Harriers"},{"$f":"IFERROR(VLOOKUP(B21,INDIRECT(\"'\"&$G$1&\"'!\"&\"$C$2:$H$200\"),3,FALSE),\"\")","v":"M"},{"$f":"IFERROR(VLOOKUP(B21,INDIRECT(\"'\"&$G$1&\"'!\"&\"$C$2:$H$200\"),4,FALSE),\"\")","v":"M"},{"$f":"SUM(LARGE((H21,J21,L21,N21,P21,R21),{1,2,3,4}))","v":233.69628934544969},"01:14:00",116.77340747914648,"",0,"01:27:22",116.9228818663032,"",0,"",0,"",0,2,116.84814467272484,null,{"$f":"COUNTIF(#REF!,'Series Table'!B21)>0","v":{"$error":"#REF!"}}]
[20,"Paul Jeggo",{"$f":"IFERROR(VLOOKUP(B22,INDIRECT(\"'\"&$G$1&\"'!\"&\"$C$2:$H$200\"),2,FALSE),\"\")","v":"Springfield"},{"$f":"IFERROR(VLOOKUP(B22,INDIRECT(\"'\"&$G$1&\"'!\"&\"$C$2:$H$200\"),3,FALSE),\"\")","v":"M"},{"$f":"IFERROR(VLOOKUP(B22,INDIRECT(\"'\"&$G$1&\"'!\"&\"$C$2:$H$200\"),4,FALSE),\"\")","v":"M50"},{"$f":"SUM(LARGE((H22,J22,L22,N22,P22,R22),{1,2,3,4}))","v":226.15951502635457},"01:21:16",108.60070605142305,0.15811342592592592,117.55880897493152,"",0,"",0,"",0,"",0,2,113.07975751317728,null,{"$f":"COUNTIF(#REF!,'Series Table'!B22)>0","v":{"$error":"#REF!"}}]
[21,"John Price",{"$f":"IFERROR(VLOOKUP(B23,INDIRECT(\"'\"&$M$1&\"'!\"&\"$C$2:$H$200\"),2,FALSE),\"\")","v":"Hay Hotfooters"},{"$f":"IFERROR(VLOOKUP(B23,INDIRECT(\"'\"&$M$1&\"'!\"&\"$C$2:$H$200\"),3,FALSE),\"\")","v":"M"},{"$f":"IFERROR(VLOOKUP(B23,INDIRECT(\"'\"&$M$1&\"'!\"&\"$C$2:$H$200\"),4,FALSE),\"\")","v":"M60"},{"$f":"SUM(LARGE((H23,J23,L23,N23,P23,R23),{1,2,3,4}))","v":226.0744379931059},"01:49:48",76.509731637976827,"",0,"",0,4.1712962962962959E-2,81.616117376546612,9.5969560185185196E-2,67.948588978582464,"",0,3,75.358145997701968,null,{"$f":"COUNTIF(#REF!,'Series Table'!B23)>0","v":{"$error":"#REF!"}}]
[22,"Les Williams",{"$f":"IFERROR(VLOOKUP(B24,INDIRECT(\"'\"&$M$1&\"'!\"&\"$C$2:$H$200\"),2,FALSE),\"\")","v":"Eryri"},{"$f":"IFERROR(VLOOKUP(B24,INDIRECT(\"'\"&$M$1&\"'!\"&\"$C$2:$H$200\"),3,FALSE),\"\")","v":"M"},{"$f":"IFERROR(VLOOKUP(B24,INDIRECT(\"'\"&$M$1&\"'!\"&\"$C$2:$H$200\"),4,FALSE),\"\")","v":"M70"},{"$f":"SUM(LARGE((H24,J24,L24,N24,P24,R24),{1,2,3,4}))","v":223.03628042342774},"01:52:16",73.735511887281731,"",0,"",0,4.3831018518518512E-2,75.604949085733097,9.179270833333332E-2,73.695819450412898,"",0,3,74.345426807809247,null,{"$f":"COUNTIF(#REF!,'Series Table'!B24)>0","v":{"$error":"#REF!"}}]
[23,"Anthony Powell",{"$f":"IFERROR(VLOOKUP(B25,INDIRECT(\"'\"&$M$1&\"'!\"&\"$C$2:$H$200\"),2,FALSE),\"\")","v":"Maldwyn Harriers"},{"$f":"IFERROR(VLOOKUP(B25,INDIRECT(\"'\"&$M$1&\"'!\"&\"$C$2:$H$200\"),3,FALSE),\"\")","v":"M"},{"$f":"IFERROR(VLOOKUP(B25,INDIRECT(\"'\"&$M$1&\"'!\"&\"$C$2:$H$200\"),4,FALSE),\"\")","v":"M40"},{"$f":"SUM(LARGE((H25,J25,L25,N25,P25,R25),{1,2,3,4}))","v":223.00232461974855},"",0,"",0,"01:34:44",109.91790548036388,3.0624999999999999E-2,113.08441913938468,"",0,"",0,2,111.50116230987427,null,{"$f":"COUNTIF(#REF!,'Series Table'!B25)>0","v":{"$error":"#REF!"}}]
[24,"Nick Biggs",{"$f":"IFERROR(VLOOKUP(B26,INDIRECT(\"'\"&$M$1&\"'!\"&\"$C$2:$H$200\"),2,FALSE),\"\")","v":"Vegan Runners"},{"$f":"IFERROR(VLOOKUP(B26,INDIRECT(\"'\"&$M$1&\"'!\"&\"$C$2:$H$200\"),3,FALSE),\"\")","v":"M"},{"$f":"IFERROR(VLOOKUP(B26,INDIRECT(\"'\"&$M$1&\"'!\"&\"$C$2:$H$200\"),4,FALSE),\"\")","v":"M40"},{"$f":"SUM(LARGE((H26,J26,L26,N26,P26,R26),{1,2,3,4}))","v":222.55255990376108},"01:20:49",109.10681370864445,"",0,"",0,3.0497685185185183E-2,113.44574619511663,"",0,"",0,2,111.27627995188054,null,{"$f":"COUNTIF(#REF!,'Series Table'!B26)>0","v":{"$error":"#REF!"}}]
[25,"Helen Brown",{"$f":"IFERROR(VLOOKUP(B27,INDIRECT(\"'\"&$M$1&\"'!\"&\"$C$2:$H$200\"),2,FALSE),\"\")","v":"Mynydd Du"},{"$f":"IFERROR(VLOOKUP(B27,INDIRECT(\"'\"&$M$1&\"'!\"&\"$C$2:$H$200\"),3,FALSE),\"\")","v":"F"},{"$f":"IFERROR(VLOOKUP(B27,INDIRECT(\"'\"&$M$1&\"'!\"&\"$C$2:$H$200\"),4,FALSE),\"\")","v":"F40"},{"$f":"SUM(LARGE((H27,J27,L27,N27,P27,R27),{1,2,3,4}))","v":219.40340487386948},"",0,"",0,"01:36:06",108.61833972550636,3.1435185185185184E-2,110.7850651483631,"",0,"",0,2,109.70170243693474,null,{"$f":"COUNTIF(#REF!,'Series Table'!B27)>0","v":{"$error":"#REF!"}}]
[26,"Matthew Lawson",{"$f":"IFERROR(VLOOKUP(B28,INDIRECT(\"'\"&$K$1&\"'!\"&\"$C$2:$H$200\"),2,FALSE),\"\")","v":"Chepstow Harriers"},{"$f":"IFERROR(VLOOKUP(B28,INDIRECT(\"'\"&$K$1&\"'!\"&\"$C$2:$H$200\"),3,FALSE),\"\")","v":"M"},{"$f":"IFERROR(VLOOKUP(B28,INDIRECT(\"'\"&$K$1&\"'!\"&\"$C$2:$H$200\"),4,FALSE),\"\")","v":"M40"},{"$f":"SUM(LARGE((H28,J28,L28,N28,P28,R28),{1,2,3,4}))","v":215.8926700006428},"",0,"",0,"01:37:04",107.69913467938761,"",0,6.6721180555555551E-2,108.1935353212552,"",0,2,107.9463350003214,null,{"$f":"COUNTIF(#REF!,'Series Table'!B28)>0","v":{"$error":"#REF!"}}]
[27,"Jeremy Jehan",{"$f":"IFERROR(VLOOKUP(B29,INDIRECT(\"'\"&$I$1&\"'!\"&\"$C$2:$H$200\"),2,FALSE),\"\")","v":"Wye Valley Runners"},{"$f":"IFERROR(VLOOKUP(B29,INDIRECT(\"'\"&$I$1&\"'!\"&\"$C$2:$H$200\"),3,FALSE),\"\")","v":"M"},{"$f":"IFERROR(VLOOKUP(B29,INDIRECT(\"'\"&$I$1&\"'!\"&\"$C$2:$H$200\"),4,FALSE),\"\")","v":"M40"},{"$f":"SUM(LARGE((H29,J29,L29,N29,P29,R29),{1,2,3,4}))","v":209.14969655659752},"01:28:26",100.54047299197101,0.17527777777777778,108.6092235646265,"",0,"",0,"",0,"",0,2,104.57484827829876,null,{"$f":"COUNTIF(#REF!,'Series Table'!B29)>0","v":{"$error":"#REF!"}}]
[28,"Nick Dallimore",{"$f":"IFERROR(VLOOKUP(B30,INDIRECT(\"'\"&$K$1&\"'!\"&\"$C$2:$H$200\"),2,FALSE),\"\")","v":"MDC"},{"$f":"IFERROR(VLOOKUP(B30,INDIRECT(\"'\"&$K$1&\"'!\"&\"$C$2:$H$200\"),3,FALSE),\"\")","v":"M"},{"$f":"IFERROR(VLOOKUP(B30,INDIRECT(\"'\"&$K$1&\"'!\"&\"$C$2:$H$200\"),4,FALSE),\"\")","v":"M60"},{"$f":"SUM(LARGE((H30,J30,L30,N30,P30,R30),{1,2,3,4}))","v":206.6780828604582},"",0,"",0,"01:43:25",101.66090842815937,"",0,6.9029629629629621E-2,105.01717443229883,"",0,2,103.3390414302291,null,{"$f":"COUNTIF(#REF!,'Series Table'!B30)>0","v":{"$error":"#REF!"}}]
[29,"Helen Marshall",{"$f":"IFERROR(VLOOKUP(B31,INDIRECT(\"'\"&$M$1&\"'!\"&\"$C$2:$H$200\"),2,FALSE),\"\")","v":"Aberystwyth AC"},{"$f":"IFERROR(VLOOKUP(B31,INDIRECT(\"'\"&$M$1&\"'!\"&\"$C$2:$H$200\"),3,FALSE),\"\")","v":"F"},{"$f":"IFERROR(VLOOKUP(B31,INDIRECT(\"'\"&$M$1&\"'!\"&\"$C$2:$H$200\"),4,FALSE),\"\")","v":"F"},{"$f":"SUM(LARGE((H31,J31,L31,N31,P31,R31),{1,2,3,4}))","v":203.70339920607981},"",0,"",0,"01:46:36",98.633871121113174,3.3449074074074069E-2,105.06952808496663,"",0,"",0,2,101.8516996030399,null,{"$f":"COUNTIF(#REF!,'Series Table'!B31)>0","v":{"$error":"#REF!"}}]
[30,"Kevin Hagley",{"$f":"IFERROR(VLOOKUP(B32,INDIRECT(\"'\"&$M$1&\"'!\"&\"$C$2:$H$200\"),2,FALSE),\"\")","v":"South West Road Runners"},{"$f":"IFERROR(VLOOKUP(B32,INDIRECT(\"'\"&$M$1&\"'!\"&\"$C$2:$H$200\"),3,FALSE),\"\")","v":"M"},{"$f":"IFERROR(VLOOKUP(B32,INDIRECT(\"'\"&$M$1&\"'!\"&\"$C$2:$H$200\"),4,FALSE),\"\")","v":"M50"},{"$f":"SUM(LARGE((H32,J32,L32,N32,P32,R32),{1,2,3,4}))","v":202.16300080596727},"",0,"",0,"01:46:42",98.538780943928501,3.3958333333333333E-2,103.62421986203879,"",0,"",0,2,101.08150040298364,null,{"$f":"COUNTIF(#REF!,'Series Table'!B32)>0","v":{"$error":"#REF!"}}]
[31,"Andy Horlick",{"$f":"IFERROR(VLOOKUP(B33,INDIRECT(\"'\"&$K$1&\"'!\"&\"$C$2:$H$200\"),2,FALSE),\"\")","v":"Forest Of Dean Ac"},{"$f":"IFERROR(VLOOKUP(B33,INDIRECT(\"'\"&$K$1&\"'!\"&\"$C$2:$H$200\"),3,FALSE),\"\")","v":"M"},{"$f":"IFERROR(VLOOKUP(B33,INDIRECT(\"'\"&$K$1&\"'!\"&\"$C$2:$H$200\"),4,FALSE),\"\")","v":"M40"},{"$f":"SUM(LARGE((H33,J33,L33,N33,P33,R33),{1,2,3,4}))","v":200.81923508775873},"",0,"",0,"01:52:09",93.356366287362505,"",0,6.7252199074074079E-2,107.46286880039624,"",0,2,100.40961754387936,null,{"$f":"COUNTIF(#REF!,'Series Table'!B33)>0","v":{"$error":"#REF!"}}]
[32,"David Mullin",{"$f":"IFERROR(VLOOKUP(B34,INDIRECT(\"'\"&$K$1&\"'!\"&\"$C$2:$H$200\"),2,FALSE),\"\")","v":"Mercia Fell Runners"},{"$f":"IFERROR(VLOOKUP(B34,INDIRECT(\"'\"&$K$1&\"'!\"&\"$C$2:$H$200\"),3,FALSE),\"\")","v":"M"},{"$f":"IFERROR(VLOOKUP(B34,INDIRECT(\"'\"&$K$1&\"'!\"&\"$C$2:$H$200\"),4,FALSE),\"\")","v":"M40"},{"$f":"SUM(LARGE((H34,J34,L34,N34,P34,R34),{1,2,3,4}))","v":198.63330319521236},"",0,"",0,"01:45:56",99.267805635677831,"",0,7.3137037037037042E-2,99.365497559534546,"",0,2,99.316651597606182,null,{"$f":"COUNTIF(#REF!,'Series Table'!B34)>0","v":{"$error":"#REF!"}}]
[33,"Andy Stott",{"$f":"IFERROR(VLOOKUP(B35,INDIRECT(\"'\"&$K$1&\"'!\"&\"$C$2:$H$200\"),2,FALSE),\"\")","v":"MDC"},{"$f":"IFERROR(VLOOKUP(B35,INDIRECT(\"'\"&$K$1&\"'!\"&\"$C$2:$H$200\"),3,FALSE),\"\")","v":"M"},{"$f":"IFERROR(VLOOKUP(B35,INDIRECT(\"'\"&$K$1&\"'!\"&\"$C$2:$H$200\"),4,FALSE),\"\")","v":"M50"},{"$f":"SUM(LARGE((H35,J35,L35,N35,P35,R35),{1,2,3,4}))","v":196.1936314270265},"",0,"",0,"01:49:28",95.907952708485197,"",0,7.2468287037037046E-2,100.28567871854131,"",0,2,98.096815713513251,null,{"$f":"COUNTIF(#REF!,'Series Table'!B35)>0","v":{"$error":"#REF!"}}]
[34,"Martin Carter",{"$f":"IFERROR(VLOOKUP(B36,INDIRECT(\"'\"&$G$1&\"'!\"&\"$C$2:$H$200\"),2,FALSE),\"\")","v":"Hay Hotfooters"},{"$f":"IFERROR(VLOOKUP(B36,INDIRECT(\"'\"&$G$1&\"'!\"&\"$C$2:$H$200\"),3,FALSE),\"\")","v":"M"},{"$f":"IFERROR(VLOOKUP(B36,INDIRECT(\"'\"&$G$1&\"'!\"&\"$C$2:$H$200\"),4,FALSE),\"\")","v":"M50"},{"$f":"SUM(LARGE((H36,J36,L36,N36,P36,R36),{1,2,3,4}))","v":193.02335745768644},"01:35:31",92.573963572745186,"",0,"",0,"",0,7.2349305555555563E-2,100.44939388494126,"",0,2,96.511678728843222,null,{"$f":"COUNTIF(#REF!,'Series Table'!B36)>0","v":{"$error":"#REF!"}}]
[35,"Julian Boon",{"$f":"IFERROR(VLOOKUP(B37,INDIRECT(\"'\"&$M$1&\"'!\"&\"$C$2:$H$200\"),2,FALSE),\"\")","v":"Forest of Dean AC"},{"$f":"IFERROR(VLOOKUP(B37,INDIRECT(\"'\"&$M$1&\"'!\"&\"$C$2:$H$200\"),3,FALSE),\"\")","v":"M"},{"$f":"IFERROR(VLOOKUP(B37,INDIRECT(\"'\"&$M$1&\"'!\"&\"$C$2:$H$200\"),4,FALSE),\"\")","v":"M40"},{"$f":"SUM(LARGE((H37,J37,L37,N37,P37,R37),{1,2,3,4}))","v":184.38795595113362},"",0,"",0,"",0,3.5173611111111107E-2,100.17518887550642,8.4149421296296309E-2,84.212767075627212,"",0,2,92.19397797556681,null,{"$f":"COUNTIF(#REF!,'Series Table'!B37)>0","v":{"$error":"#REF!"}}]
[36,"John Jaspers",{"$f":"IFERROR(VLOOKUP(B38,INDIRECT(\"'\"&$M$1&\"'!\"&\"$C$2:$H$200\"),2,FALSE),\"\")","v":"Hay Hotfooters"},{"$f":"IFERROR(VLOOKUP(B38,INDIRECT(\"'\"&$M$1&\"'!\"&\"$C$2:$H$200\"),3,FALSE),\"\")","v":"M"},{"$f":"IFERROR(VLOOKUP(B38,INDIRECT(\"'\"&$M$1&\"'!\"&\"$C$2:$H$200\"),4,FALSE),\"\")","v":"M40"},{"$f":"SUM(LARGE((H38,J38,L38,N38,P38,R38),{1,2,3,4}))","v":163.51251935547339},"",0,"",0,"",0,4.1261574074074069E-2,82.897186028687202,8.6763888888888877E-2,80.615333326786171,"",0,2,81.756259677736693,null,{"$f":"COUNTIF(#REF!,'Series Table'!B38)>0","v":{"$error":"#REF!"}}]
[37,"Karen Elvers",{"$f":"IFERROR(VLOOKUP(B39,INDIRECT(\"'\"&$G$1&\"'!\"&\"$C$2:$H$200\"),2,FALSE),\"\")","v":"MDC"},{"$f":"IFERROR(VLOOKUP(B39,INDIRECT(\"'\"&$G$1&\"'!\"&\"$C$2:$H$200\"),3,FALSE),\"\")","v":"F"},{"$f":"IFERROR(VLOOKUP(B39,INDIRECT(\"'\"&$G$1&\"'!\"&\"$C$2:$H$200\"),4,FALSE),\"\")","v":"F40"},{"$f":"SUM(LARGE((H39,J39,L39,N39,P39,R39),{1,2,3,4}))","v":156.64843849398042},"01:48:18",78.196757162048186,"",0,"",0,"",0,8.8336342592592598E-2,78.451681331932235,"",0,2,78.324219246990211,null,{"$f":"COUNTIF(#REF!,'Series Table'!B39)>0","v":{"$error":"#REF!"}}]
[38,"Caroline Dallimore",{"$f":"IFERROR(VLOOKUP(B40,INDIRECT(\"'\"&$K$1&\"'!\"&\"$C$2:$H$200\"),2,FALSE),\"\")","v":"MDC"},{"$f":"IFERROR(VLOOKUP(B40,INDIRECT(\"'\"&$K$1&\"'!\"&\"$C$2:$H$200\"),3,FALSE),\"\")","v":"F"},{"$f":"IFERROR(VLOOKUP(B40,INDIRECT(\"'\"&$K$1&\"'!\"&\"$C$2:$H$200\"),4,FALSE),\"\")","v":"F60"},{"$f":"SUM(LARGE((H40,J40,L40,N40,P40,R40),{1,2,3,4}))","v":155.96265251032071},"",0,"",0,"02:08:40",77.650638689023424,"",0,8.8437847222222213E-2,78.312013821297285,"",0,2,77.981326255160354,null,{"$f":"COUNTIF(#REF!,'Series Table'!B40)>0","v":{"$error":"#REF!"}}]
[39,"Paul Symons",{"$f":"IFERROR(VLOOKUP(B41,INDIRECT(\"'\"&$K$1&\"'!\"&\"$C$2:$H$200\"),2,FALSE),\"\")","v":"Unattached"},{"$f":"IFERROR(VLOOKUP(B41,INDIRECT(\"'\"&$K$1&\"'!\"&\"$C$2:$H$200\"),3,FALSE),\"\")","v":"M"},{"$f":"IFERROR(VLOOKUP(B41,INDIRECT(\"'\"&$K$1&\"'!\"&\"$C$2:$H$200\"),4,FALSE),\"\")","v":"M50"},{"$f":"SUM(LARGE((H41,J41,L41,N41,P41,R41),{1,2,3,4}))","v":146.01400998622262},"",0,"",0,"02:14:13",72.373133855272755,"",0,9.1832638888888887E-2,73.640876130949849,"",0,2,73.007004993111309,null,{"$f":"COUNTIF(#REF!,'Series Table'!B41)>0","v":{"$error":"#REF!"}}]
[40,"Dylan Griffiths",{"$f":"IFERROR(VLOOKUP(B42,INDIRECT(\"'\"&$I$1&\"'!\"&\"$C$2:$H$200\"),2,FALSE),\"\")","v":"Rhedwyr Hebog"},{"$f":"IFERROR(VLOOKUP(B42,INDIRECT(\"'\"&$I$1&\"'!\"&\"$C$2:$H$200\"),3,FALSE),\"\")","v":"M"},{"$f":"IFERROR(VLOOKUP(B42,INDIRECT(\"'\"&$I$1&\"'!\"&\"$C$2:$H$200\"),4,FALSE),\"\")","v":"M"},{"$f":"SUM(LARGE((H42,J42,L42,N42,P42,R42),{1,2,3,4}))","v":128.4395254245471},"",0,0.13724537037037035,128.4395254245471,"",0,"",0,"",0,"",0,1,128.4395254245471,null,{"$f":"COUNTIF(#REF!,'Series Table'!B42)>0","v":{"$error":"#REF!"}}]
[41,"Michael Corrales",{"$f":"IFERROR(VLOOKUP(B43,INDIRECT(\"'\"&$M$1&\"'!\"&\"$C$2:$H$200\"),2,FALSE),\"\")","v":"North Wales Road Runners"},{"$f":"IFERROR(VLOOKUP(B43,INDIRECT(\"'\"&$M$1&\"'!\"&\"$C$2:$H$200\"),3,FALSE),\"\")","v":"M"},{"$f":"IFERROR(VLOOKUP(B43,INDIRECT(\"'\"&$M$1&\"'!\"&\"$C$2:$H$200\"),4,FALSE),\"\")","v":"M"},{"$f":"SUM(LARGE((H43,J43,L43,N43,P43,R43),{1,2,3,4}))","v":128.29300339428448},"",0,"",0,"",0,2.5266203703703704E-2,128.29300339428448,"",0,"",0,1,128.29300339428448,null,{"$f":"COUNTIF(#REF!,'Series Table'!B43)>0","v":{"$error":"#REF!"}}]
[42,"Daryl John",{"$f":"IFERROR(VLOOKUP(B44,INDIRECT(\"'\"&$I$1&\"'!\"&\"$C$2:$H$200\"),2,FALSE),\"\")","v":"Trots"},{"$f":"IFERROR(VLOOKUP(B44,INDIRECT(\"'\"&$I$1&\"'!\"&\"$C$2:$H$200\"),3,FALSE),\"\")","v":"M"},{"$f":"IFERROR(VLOOKUP(B44,INDIRECT(\"'\"&$I$1&\"'!\"&\"$C$2:$H$200\"),4,FALSE),\"\")","v":"M40"},{"$f":"SUM(LARGE((H44,J44,L44,N44,P44,R44),{1,2,3,4}))","v":126.04975076340024},"",0,0.14182870370370371,126.04975076340024,"",0,"",0,"",0,"",0,1,126.04975076340024,null,{"$f":"COUNTIF(#REF!,'Series Table'!B44)>0","v":{"$error":"#REF!"}}]
[43,"Samuel Bevan",{"$f":"IFERROR(VLOOKUP(B45,INDIRECT(\"'\"&$M$1&\"'!\"&\"$C$2:$H$200\"),2,FALSE),\"\")","v":"Basingstoke & Mid Hants AC"},{"$f":"IFERROR(VLOOKUP(B45,INDIRECT(\"'\"&$M$1&\"'!\"&\"$C$2:$H$200\"),3,FALSE),\"\")","v":"M"},{"$f":"IFERROR(VLOOKUP(B45,INDIRECT(\"'\"&$M$1&\"'!\"&\"$C$2:$H$200\"),4,FALSE),\"\")","v":"M"},{"$f":"SUM(LARGE((H45,J45,L45,N45,P45,R45),{1,2,3,4}))","v":125.92795357494802},"",0,"",0,"",0,2.6099537037037036E-2,125.92795357494802,"",0,"",0,1,125.92795357494802,null,{"$f":"COUNTIF(#REF!,'Series Table'!B45)>0","v":{"$error":"#REF!"}}]
[44,"Daniel Hooper",{"$f":"IFERROR(VLOOKUP(B46,INDIRECT(\"'\"&$I$1&\"'!\"&\"$C$2:$H$200\"),2,FALSE),\"\")","v":"Cwmdu, Llandeilo"},{"$f":"IFERROR(VLOOKUP(B46,INDIRECT(\"'\"&$I$1&\"'!\"&\"$C$2:$H$200\"),3,FALSE),\"\")","v":"M"},{"$f":"IFERROR(VLOOKUP(B46,INDIRECT(\"'\"&$I$1&\"'!\"&\"$C$2:$H$200\"),4,FALSE),\"\")","v":"M40"},{"$f":"SUM(LARGE((H46,J46,L46,N46,P46,R46),{1,2,3,4}))","v":124.99366347627725},"",0,0.14385416666666667,124.99366347627725,"",0,"",0,"",0,"",0,1,124.99366347627725,null,{"$f":"COUNTIF(#REF!,'Series Table'!B46)>0","v":{"$error":"#REF!"}}]
[45,"Billy Starling",{"$f":"IFERROR(VLOOKUP(B47,INDIRECT(\"'\"&$M$1&\"'!\"&\"$C$2:$H$200\"),2,FALSE),\"\")","v":"Mercia Fell Runners"},{"$f":"IFERROR(VLOOKUP(B47,INDIRECT(\"'\"&$M$1&\"'!\"&\"$C$2:$H$200\"),3,FALSE),\"\")","v":"M"},{"$f":"IFERROR(VLOOKUP(B47,INDIRECT(\"'\"&$M$1&\"'!\"&\"$C$2:$H$200\"),4,FALSE),\"\")","v":"M"},{"$f":"SUM(LARGE((H47,J47,L47,N47,P47,R47),{1,2,3,4}))","v":123.95707872550092},"",0,"",0,"",0,2.6793981481481485E-2,123.95707872550092,"",0,"",0,1,123.95707872550092,null,{"$f":"COUNTIF(#REF!,'Series Table'!B47)>0","v":{"$error":"#REF!"}}]
[46,"Balazs Pinter",{"$f":"IFERROR(VLOOKUP(B48,INDIRECT(\"'\"&$I$1&\"'!\"&\"$C$2:$H$200\"),2,FALSE),\"\")","v":"Aberystwyth Ac"},{"$f":"IFERROR(VLOOKUP(B48,INDIRECT(\"'\"&$I$1&\"'!\"&\"$C$2:$H$200\"),3,FALSE),\"\")","v":"M"},{"$f":"IFERROR(VLOOKUP(B48,INDIRECT(\"'\"&$I$1&\"'!\"&\"$C$2:$H$200\"),4,FALSE),\"\")","v":"M40"},{"$f":"SUM(LARGE((H48,J48,L48,N48,P48,R48),{1,2,3,4}))","v":123.15305420443434},"",0,0.14738425925925927,123.15305420443434,"",0,"",0,"",0,"",0,1,123.15305420443434,null,{"$f":"COUNTIF(#REF!,'Series Table'!B48)>0","v":{"$error":"#REF!"}}]
[47,"Little Dave Cumins",{"$f":"IFERROR(VLOOKUP(B49,INDIRECT(\"'\"&$I$1&\"'!\"&\"$C$2:$H$200\"),2,FALSE),\"\")","v":"Ddmt/Kom/Ttb"},{"$f":"IFERROR(VLOOKUP(B49,INDIRECT(\"'\"&$I$1&\"'!\"&\"$C$2:$H$200\"),3,FALSE),\"\")","v":"M"},{"$f":"IFERROR(VLOOKUP(B49,INDIRECT(\"'\"&$I$1&\"'!\"&\"$C$2:$H$200\"),4,FALSE),\"\")","v":"M40"},{"$f":"SUM(LARGE((H49,J49,L49,N49,P49,R49),{1,2,3,4}))","v":122.12110605530277},"",0,0.14936342592592591,122.12110605530277,"",0,"",0,"",0,"",0,1,122.12110605530277,null,{"$f":"COUNTIF(#REF!,'Series Table'!B49)>0","v":{"$error":"#REF!"}}]
[48,"Sam Hawking",{"$f":"IFERROR(VLOOKUP(B50,INDIRECT(\"'\"&$I$1&\"'!\"&\"$C$2:$H$200\"),2,FALSE),\"\")","v":"Neath"},{"$f":"IFERROR(VLOOKUP(B50,INDIRECT(\"'\"&$I$1&\"'!\"&\"$C$2:$H$200\"),3,FALSE),\"\")","v":"M"},{"$f":"IFERROR(VLOOKUP(B50,INDIRECT(\"'\"&$I$1&\"'!\"&\"$C$2:$H$200\"),4,FALSE),\"\")","v":"M40"},{"$f":"SUM(LARGE((H50,J50,L50,N50,P50,R50),{1,2,3,4}))","v":121.77108855442773},"",0,0.15003472222222222,121.77108855442773,"",0,"",0,"",0,"",0,1,121.77108855442773,null,{"$f":"COUNTIF(#REF!,'Series Table'!B50)>0","v":{"$error":"#REF!"}}]
[49,"Jim Webb",{"$f":"IFERROR(VLOOKUP(B51,INDIRECT(\"'\"&$M$1&\"'!\"&\"$C$2:$H$200\"),2,FALSE),\"\")","v":"Team Bath AC"},{"$f":"IFERROR(VLOOKUP(B51,INDIRECT(\"'\"&$M$1&\"'!\"&\"$C$2:$H$200\"),3,FALSE),\"\")","v":"M"},{"$f":"IFERROR(VLOOKUP(B51,INDIRECT(\"'\"&$M$1&\"'!\"&\"$C$2:$H$200\"),4,FALSE),\"\")","v":"M"},{"$f":"SUM(LARGE((H51,J51,L51,N51,P51,R51),{1,2,3,4}))","v":121.6248768203219},"",0,"",0,"",0,2.7615740740740743E-2,121.6248768203219,"",0,"",0,1,121.6248768203219,null,{"$f":"COUNTIF(#REF!,'Series Table'!B51)>0","v":{"$error":"#REF!"}}]
[50,"Robin Wood",{"$f":"IFERROR(VLOOKUP(B52,INDIRECT(\"'\"&$K$1&\"'!\"&\"$C$2:$H$200\"),2,FALSE),\"\")","v":"Builth & District"},{"$f":"IFERROR(VLOOKUP(B52,INDIRECT(\"'\"&$K$1&\"'!\"&\"$C$2:$H$200\"),3,FALSE),\"\")","v":"M"},{"$f":"IFERROR(VLOOKUP(B52,INDIRECT(\"'\"&$K$1&\"'!\"&\"$C$2:$H$200\"),4,FALSE),\"\")","v":"M40"},{"$f":"SUM(LARGE((H52,J52,L52,N52,P52,R52),{1,2,3,4}))","v":120.42537005927288},"",0,"",0,"01:23:41",120.42537005927288,"",0,"",0,"",0,1,120.42537005927288,null,{"$f":"COUNTIF(#REF!,'Series Table'!B52)>0","v":{"$error":"#REF!"}}]
[51,"Andrew Reeves",{"$f":"IFERROR(VLOOKUP(B53,INDIRECT(\"'\"&$M$1&\"'!\"&\"$C$2:$H$200\"),2,FALSE),\"\")","v":"Serpentine Running Club"},{"$f":"IFERROR(VLOOKUP(B53,INDIRECT(\"'\"&$M$1&\"'!\"&\"$C$2:$H$200\"),3,FALSE),\"\")","v":"M"},{"$f":"IFERROR(VLOOKUP(B53,INDIRECT(\"'\"&$M$1&\"'!\"&\"$C$2:$H$200\"),4,FALSE),\"\")","v":"M40"},{"$f":"SUM(LARGE((H53,J53,L53,N53,P53,R53),{1,2,3,4}))","v":119.58830614255996},"",0,"",0,"",0,2.8333333333333332E-2,119.58830614255996,"",0,"",0,1,119.58830614255996,null,{"$f":"COUNTIF(#REF!,'Series Table'!B53)>0","v":{"$error":"#REF!"}}]
[52,"Afan Humphries",{"$f":"IFERROR(VLOOKUP(B54,INDIRECT(\"'\"&$I$1&\"'!\"&\"$C$2:$H$200\"),2,FALSE),\"\")","v":"Caerphilly"},{"$f":"IFERROR(VLOOKUP(B54,INDIRECT(\"'\"&$I$1&\"'!\"&\"$C$2:$H$200\"),3,FALSE),\"\")","v":"M"},{"$f":"IFERROR(VLOOKUP(B54,INDIRECT(\"'\"&$I$1&\"'!\"&\"$C$2:$H$200\"),4,FALSE),\"\")","v":"M"},{"$f":"SUM(LARGE((H54,J54,L54,N54,P54,R54),{1,2,3,4}))","v":119.41752260026797},"",0,0.15454861111111109,119.41752260026797,"",0,"",0,"",0,"",0,1,119.41752260026797,null,{"$f":"COUNTIF(#REF!,'Series Table'!B54)>0","v":{"$error":"#REF!"}}]
[53,"Sian Williams",{"$f":"IFERROR(VLOOKUP(B55,INDIRECT(\"'\"&$I$1&\"'!\"&\"$C$2:$H$200\"),2,FALSE),\"\")","v":"Rhedwyr Hebog"},{"$f":"IFERROR(VLOOKUP(B55,INDIRECT(\"'\"&$I$1&\"'!\"&\"$C$2:$H$200\"),3,FALSE),\"\")","v":"F"},{"$f":"IFERROR(VLOOKUP(B55,INDIRECT(\"'\"&$I$1&\"'!\"&\"$C$2:$H$200\"),4,FALSE),\"\")","v":"F"},{"$f":"SUM(LARGE((H55,J55,L55,N55,P55,R55),{1,2,3,4}))","v":119.17613122035414},"",0,0.15501157407407407,119.17613122035414,"",0,"",0,"",0,"",0,1,119.17613122035414,null,{"$f":"COUNTIF(#REF!,'Series Table'!B55)>0","v":{"$error":"#REF!"}}]
[54,"Mark Palmer",{"$f":"IFERROR(VLOOKUP(B56,INDIRECT(\"'\"&$K$1&\"'!\"&\"$C$2:$H$200\"),2,FALSE),\"\")","v":"Unattached"},{"$f":"IFERROR(VLOOKUP(B56,INDIRECT(\"'\"&$K$1&\"'!\"&\"$C$2:$H$200\"),3,FALSE),\"\")","v":"M"},{"$f":"IFERROR(VLOOKUP(B56,INDIRECT(\"'\"&$K$1&\"'!\"&\"$C$2:$H$200\"),4,FALSE),\"\")","v":"M50"},{"$f":"SUM(LARGE((H56,J56,L56,N56,P56,R56),{1,2,3,4}))","v":118.04811562965544},"",0,"",0,"01:26:11",118.04811562965544,"",0,"",0,"",0,1,118.04811562965544,null,{"$f":"COUNTIF(#REF!,'Series Table'!B56)>0","v":{"$error":"#REF!"}}]
[55,"Nerys Jones",{"$f":"IFERROR(VLOOKUP(B57,INDIRECT(\"'\"&$I$1&\"'!\"&\"$C$2:$H$200\"),2,FALSE),\"\")","v":"Parcllyn, Ceredigion"},{"$f":"IFERROR(VLOOKUP(B57,INDIRECT(\"'\"&$I$1&\"'!\"&\"$C$2:$H$200\"),3,FALSE),\"\")","v":"F"},{"$f":"IFERROR(VLOOKUP(B57,INDIRECT(\"'\"&$I$1&\"'!\"&\"$C$2:$H$200\"),4,FALSE),\"\")","v":"F"},{"$f":"SUM(LARGE((H57,J57,L57,N57,P57,R57),{1,2,3,4}))","v":117.45621763846815},"",0,0.15831018518518519,117.45621763846815,"",0,"",0,"",0,"",0,1,117.45621763846815,null,{"$f":"COUNTIF(#REF!,'Series Table'!B57)>0","v":{"$error":"#REF!"}}]
[56,"David Powell",{"$f":"IFERROR(VLOOKUP(B58,INDIRECT(\"'\"&$I$1&\"'!\"&\"$C$2:$H$200\"),2,FALSE),\"\")","v":"Aberystwyth Ac"},{"$f":"IFERROR(VLOOKUP(B58,INDIRECT(\"'\"&$I$1&\"'!\"&\"$C$2:$H$200\"),3,FALSE),\"\")","v":"M"},{"$f":"IFERROR(VLOOKUP(B58,INDIRECT(\"'\"&$I$1&\"'!\"&\"$C$2:$H$200\"),4,FALSE),\"\")","v":"M50"},{"$f":"SUM(LARGE((H58,J58,L58,N58,P58,R58),{1,2,3,4}))","v":117.41397414698321},"",0,0.15839120370370371,117.41397414698321,"",0,"",0,"",0,"",0,1,117.41397414698321,null,{"$f":"COUNTIF(#REF!,'Series Table'!B58)>0","v":{"$error":"#REF!"}}]
[57,"David Lawson",{"$f":"IFERROR(VLOOKUP(B59,INDIRECT(\"'\"&$M$1&\"'!\"&\"$C$2:$H$200\"),2,FALSE),\"\")","v":"MDC"},{"$f":"IFERROR(VLOOKUP(B59,INDIRECT(\"'\"&$M$1&\"'!\"&\"$C$2:$H$200\"),3,FALSE),\"\")","v":"M"},{"$f":"IFERROR(VLOOKUP(B59,INDIRECT(\"'\"&$M$1&\"'!\"&\"$C$2:$H$200\"),4,FALSE),\"\")","v":"M"},{"$f":"SUM(LARGE((H59,J59,L59,N59,P59,R59),{1,2,3,4}))","v":117.35464797985328},"",0,"",0,"",0,2.9120370370370366E-2,117.35464797985328,"",0,"",0,1,117.35464797985328,null,{"$f":"COUNTIF(#REF!,'Series Table'!B59)>0","v":{"$error":"#REF!"}}]
[58,"Dee Buchanan",{"$f":"IFERROR(VLOOKUP(B60,INDIRECT(\"'\"&$I$1&\"'!\"&\"$C$2:$H$200\"),2,FALSE),\"\")","v":"San Domenico"},{"$f":"IFERROR(VLOOKUP(B60,INDIRECT(\"'\"&$I$1&\"'!\"&\"$C$2:$H$200\"),3,FALSE),\"\")","v":"M"},{"$f":"IFERROR(VLOOKUP(B60,INDIRECT(\"'\"&$I$1&\"'!\"&\"$C$2:$H$200\"),4,FALSE),\"\")","v":"M"},{"$f":"SUM(LARGE((H60,J60,L60,N60,P60,R60),{1,2,3,4}))","v":116.9070522491642},"",0,0.15936342592592592,116.9070522491642,"",0,"",0,"",0,"",0,1,116.9070522491642,null,{"$f":"COUNTIF(#REF!,'Series Table'!B60)>0","v":{"$error":"#REF!"}}]
[59,"Patrick Swann",{"$f":"IFERROR(VLOOKUP(B61,INDIRECT(\"'\"&$I$1&\"'!\"&\"$C$2:$H$200\"),2,FALSE),\"\")","v":"U/A"},{"$f":"IFERROR(VLOOKUP(B61,INDIRECT(\"'\"&$I$1&\"'!\"&\"$C$2:$H$200\"),3,FALSE),\"\")","v":"M"},{"$f":"IFERROR(VLOOKUP(B61,INDIRECT(\"'\"&$I$1&\"'!\"&\"$C$2:$H$200\"),4,FALSE),\"\")","v":"M40"},{"$f":"SUM(LARGE((H61,J61,L61,N61,P61,R61),{1,2,3,4}))","v":116.87687832667497},"",0,0.15942129629629628,116.87687832667497,"",0,"",0,"",0,"",0,1,116.87687832667497,null,{"$f":"COUNTIF(#REF!,'Series Table'!B61)>0","v":{"$error":"#REF!"}}]
[60,"Hopcyn Matthews",{"$f":"IFERROR(VLOOKUP(B62,INDIRECT(\"'\"&$M$1&\"'!\"&\"$C$2:$H$200\"),2,FALSE),\"\")","v":"Unattached"},{"$f":"IFERROR(VLOOKUP(B62,INDIRECT(\"'\"&$M$1&\"'!\"&\"$C$2:$H$200\"),3,FALSE),\"\")","v":"M"},{"$f":"IFERROR(VLOOKUP(B62,INDIRECT(\"'\"&$M$1&\"'!\"&\"$C$2:$H$200\"),4,FALSE),\"\")","v":"M"},{"$f":"SUM(LARGE((H62,J62,L62,N62,P62,R62),{1,2,3,4}))","v":116.76338552501917},"",0,"",0,"",0,2.9328703703703704E-2,116.76338552501917,"",0,"",0,1,116.76338552501917,null,{"$f":"COUNTIF(#REF!,'Series Table'!B62)>0","v":{"$error":"#REF!"}}]
[61,"Christian Poulton",{"$f":"IFERROR(VLOOKUP(B63,INDIRECT(\"'\"&$M$1&\"'!\"&\"$C$2:$H$200\"),2,FALSE),\"\")","v":"Cambridge Harriers"},{"$f":"IFERROR(VLOOKUP(B63,INDIRECT(\"'\"&$M$1&\"'!\"&\"$C$2:$H$200\"),3,FALSE),\"\")","v":"M"},{"$f":"IFERROR(VLOOKUP(B63,INDIRECT(\"'\"&$M$1&\"'!\"&\"$C$2:$H$200\"),4,FALSE),\"\")","v":"M50"},{"$f":"SUM(LARGE((H63,J63,L63,N63,P63,R63),{1,2,3,4}))","v":116.66484178254683},"",0,"",0,"",0,2.9363425925925921E-2,116.66484178254683,"",0,"",0,1,116.66484178254683,null,{"$f":"COUNTIF(#REF!,'Series Table'!B63)>0","v":{"$error":"#REF!"}}]
[62,"Tom Mollekin",{"$f":"IFERROR(VLOOKUP(B64,INDIRECT(\"'\"&$O$1&\"'!\"&\"$C$2:$H$200\"),2,FALSE),\"\")","v":"Mynydd Du"},{"$f":"IFERROR(VLOOKUP(B64,INDIRECT(\"'\"&$O$1&\"'!\"&\"$C$2:$H$200\"),3,FALSE),\"\")","v":"M"},{"$f":"IFERROR(VLOOKUP(B64,INDIRECT(\"'\"&$O$1&\"'!\"&\"$C$2:$H$200\"),4,FALSE),\"\")","v":"M"},{"$f":"SUM(LARGE((H64,J64,L64,N64,P64,R64),{1,2,3,4}))","v":116.21350814687332},"",0,"",0,"",0,"",0,6.0892592592592588E-2,116.21350814687332,"",0,1,116.21350814687332,null,{"$f":"COUNTIF(#REF!,'Series Table'!B64)>0","v":{"$error":"#REF!"}}]
[63,"Llewelyn Lloyd",{"$f":"IFERROR(VLOOKUP(B65,INDIRECT(\"'\"&$M$1&\"'!\"&\"$C$2:$H$200\"),2,FALSE),\"\")","v":"Sarn Helen"},{"$f":"IFERROR(VLOOKUP(B65,INDIRECT(\"'\"&$M$1&\"'!\"&\"$C$2:$H$200\"),3,FALSE),\"\")","v":"M"},{"$f":"IFERROR(VLOOKUP(B65,INDIRECT(\"'\"&$M$1&\"'!\"&\"$C$2:$H$200\"),4,FALSE),\"\")","v":"M"},{"$f":"SUM(LARGE((H65,J65,L65,N65,P65,R65),{1,2,3,4}))","v":116.20497098434251},"",0,"",0,"",0,2.9525462962962962E-2,116.20497098434251,"",0,"",0,1,116.20497098434251,null,{"$f":"COUNTIF(#REF!,'Series Table'!B65)>0","v":{"$error":"#REF!"}}]
[64,"Joe Starling",{"$f":"IFERROR(VLOOKUP(B66,INDIRECT(\"'\"&$M$1&\"'!\"&\"$C$2:$H$200\"),2,FALSE),\"\")","v":"Mercia Fell Runners"},{"$f":"IFERROR(VLOOKUP(B66,INDIRECT(\"'\"&$M$1&\"'!\"&\"$C$2:$H$200\"),3,FALSE),\"\")","v":"M"},{"$f":"IFERROR(VLOOKUP(B66,INDIRECT(\"'\"&$M$1&\"'!\"&\"$C$2:$H$200\"),4,FALSE),\"\")","v":"M"},{"$f":"SUM(LARGE((H66,J66,L66,N66,P66,R66),{1,2,3,4}))","v":116.10642724187015},"",0,"",0,"",0,2.9560185185185189E-2,116.10642724187015,"",0,"",0,1,116.10642724187015,null,{"$f":"COUNTIF(#REF!,'Series Table'!B66)>0","v":{"$error":"#REF!"}}]
[65,"Mark Hopkinson",{"$f":"IFERROR(VLOOKUP(B67,INDIRECT(\"'\"&$M$1&\"'!\"&\"$C$2:$H$200\"),2,FALSE),\"\")","v":"Unattached"},{"$f":"IFERROR(VLOOKUP(B67,INDIRECT(\"'\"&$M$1&\"'!\"&\"$C$2:$H$200\"),3,FALSE),\"\")","v":"M"},{"$f":"IFERROR(VLOOKUP(B67,INDIRECT(\"'\"&$M$1&\"'!\"&\"$C$2:$H$200\"),4,FALSE),\"\")","v":"M"},{"$f":"SUM(LARGE((H67,J67,L67,N67,P67,R67),{1,2,3,4}))","v":115.97503558524033},{"$f":"IFERROR(VLOOKUP(B67,INDIRECT(\"'\"&$G$1&\"'!\"&\"$C$2:$H$200\"),5,FALSE),\"\")","v":""},{"$f":"IFERROR(VLOOKUP(B67,INDIRECT(\"'\"&$G$1&\"'!\"&\"$C$2:$H$200\"),6,FALSE),0)","v":0},{"$f":"IFERROR(VLOOKUP(B67,INDIRECT(\"'\"&$I$1&\"'!\"&\"$C$2:$G$200\"),5,FALSE),\"\")","v":""},{"$f":"IFERROR(VLOOKUP(B67,INDIRECT(\"'\"&$I$1&\"'!\"&\"$C$2:$H$200\"),6,FALSE),0)","v":0},{"$f":"IFERROR(VLOOKUP(B67,INDIRECT(\"'\"&$K$1&\"'!\"&\"$C$2:$H$200\"),5,FALSE),\"\")","v":""},{"$f":"IFERROR(VLOOKUP(B67,INDIRECT(\"'\"&$K$1&\"'!\"&\"$C$2:$H$200\"),6,FALSE),0)","v":0},{"$f":"IFERROR(VLOOKUP(B67,INDIRECT(\"'\"&$M$1&\"'!\"&\"$C$2:$h$200\"),5,FALSE),\"\")","v":2.960648148148148E-2},{"$f":"IFERROR(VLOOKUP(B67,INDIRECT(\"'\"&$M$1&\"'!\"&\"$C$2:$h$200\"),6,FALSE),0)","v":115.97503558524033},{"$f":"IFERROR(VLOOKUP(B67,INDIRECT(\"'\"&$O$1&\"'!\"&\"$C$2:$h$200\"),5,FALSE),\"\")","v":""},{"$f":"IFERROR(VLOOKUP(B67,INDIRECT(\"'\"&$O$1&\"'!\"&\"$C$2:$h$200\"),6,FALSE),0)","v":0},{"$f":"IFERROR(VLOOKUP(B67,INDIRECT(\"'\"&$Q$1&\"'!\"&\"$C$2:$h$200\"),5,FALSE),\"\")","v":""},{"$f":"IFERROR(VLOOKUP(B67,INDIRECT(\"'\"&$Q$1&\"'!\"&\"$C$2:$h$200\"),6,FALSE),0)","v":0},{"$f":"6-COUNTIF(G67:Q67,\"\")","v":1},{"$f":"F67/IF(S67>4,4,S67)","v":115.97503558524033},null,{"$f":"COUNTIF(#REF!,'Series Table'!B67)>0","v":{"$error":"#REF!"}}]
[{"$f":"ROW(A66)","v":66},"Simon Roberts",{"$f":"IFERROR(VLOOKUP(B68,INDIRECT(\"'\"&$I$1&\"'!\"&\"$C$2:$H$200\"),2,FALSE),\"\")","v":"Chester Ac"},{"$f":"IFERROR(VLOOKUP(B68,INDIRECT(\"'\"&$I$1&\"'!\"&\"$C$2:$H$200\"),3,FALSE),\"\")","v":"M"},{"$f":"IFERROR(VLOOKUP(B68,INDIRECT(\"'\"&$I$1&\"'!\"&\"$C$2:$H$200\"),4,FALSE),\"\")","v":"M40"},{"$f":"SUM(LARGE((H68,J68,L68,N68,P68,R68),{1,2,3,4}))","v":115.85699974653907},"",0,0.16137731481481482,115.85699974653907,"",0,"",0,"",0,"",0,1,115.85699974653907,null,{"$f":"COUNTIF(#REF!,'Series Table'!B68)>0","v":{"$error":"#REF!"}}]
[67,"Tarbo Fukazawa",{"$f":"IFERROR(VLOOKUP(B69,INDIRECT(\"'\"&$M$1&\"'!\"&\"$C$2:$H$200\"),2,FALSE),\"\")","v":"Cambridge Harriers"},{"$f":"IFERROR(VLOOKUP(B69,INDIRECT(\"'\"&$M$1&\"'!\"&\"$C$2:$H$200\"),3,FALSE),\"\")","v":"M"},{"$f":"IFERROR(VLOOKUP(B69,INDIRECT(\"'\"&$M$1&\"'!\"&\"$C$2:$H$200\"),4,FALSE),\"\")","v":"M"},{"$f":"SUM(LARGE((H69,J69,L69,N69,P69,R69),{1,2,3,4}))","v":115.25238147377644},"",0,"",0,"",0,2.9861111111111113E-2,115.25238147377644,"",0,"",0,1,115.25238147377644,null,{"$f":"COUNTIF(#REF!,'Series Table'!B69)>0","v":{"$error":"#REF!"}}]
[68,"Daniel Nettelfield",{"$f":"IFERROR(VLOOKUP(B70,INDIRECT(\"'\"&$M$1&\"'!\"&\"$C$2:$H$200\"),2,FALSE),\"\")","v":"South Molton Strugglers"},{"$f":"IFERROR(VLOOKUP(B70,INDIRECT(\"'\"&$M$1&\"'!\"&\"$C$2:$H$200\"),3,FALSE),\"\")","v":"M"},{"$f":"IFERROR(VLOOKUP(B70,INDIRECT(\"'\"&$M$1&\"'!\"&\"$C$2:$H$200\"),4,FALSE),\"\")","v":"M"},{"$f":"SUM(LARGE((H70,J70,L70,N70,P70,R70),{1,2,3,4}))","v":115.21953355961898},"",0,"",0,"",0,2.9872685185185183E-2,115.21953355961898,"",0,"",0,1,115.21953355961898,null,{"$f":"COUNTIF(#REF!,'Series Table'!B70)>0","v":{"$error":"#REF!"}}]
[69,"Iwan Morton",{"$f":"IFERROR(VLOOKUP(B71,INDIRECT(\"'\"&$K$1&\"'!\"&\"$C$2:$H$200\"),2,FALSE),\"\")","v":"Mynydd Du"},{"$f":"IFERROR(VLOOKUP(B71,INDIRECT(\"'\"&$K$1&\"'!\"&\"$C$2:$H$200\"),3,FALSE),\"\")","v":"M"},{"$f":"IFERROR(VLOOKUP(B71,INDIRECT(\"'\"&$K$1&\"'!\"&\"$C$2:$H$200\"),4,FALSE),\"\")","v":"M40"},{"$f":"SUM(LARGE((H71,J71,L71,N71,P71,R71),{1,2,3,4}))","v":114.67241433959872},"",0,"",0,"01:29:44",114.67241433959872,"",0,"",0,"",0,1,114.67241433959872,null,{"$f":"COUNTIF(#REF!,'Series Table'!B71)>0","v":{"$error":"#REF!"}}]
[70,"Thomas Mollekin",{"$f":"IFERROR(VLOOKUP(B72,INDIRECT(\"'\"&$M$1&\"'!\"&\"$C$2:$H$200\"),2,FALSE),\"\")","v":"Mynydd Du"},{"$f":"IFERROR(VLOOKUP(B72,INDIRECT(\"'\"&$M$1&\"'!\"&\"$C$2:$H$200\"),3,FALSE),\"\")","v":"M"},{"$f":"IFERROR(VLOOKUP(B72,INDIRECT(\"'\"&$M$1&\"'!\"&\"$C$2:$H$200\"),4,FALSE),\"\")","v":"M"},{"$f":"SUM(LARGE((H72,J72,L72,N72,P72,R72),{1,2,3,4}))","v":114.56257527646994},"",0,"",0,"",0,3.0104166666666668E-2,114.56257527646994,"",0,"",0,1,114.56257527646994,null,{"$f":"COUNTIF(#REF!,'Series Table'!B72)>0","v":{"$error":"#REF!"}}]
[71,"Gary Davies",{"$f":"IFERROR(VLOOKUP(B73,INDIRECT(\"'\"&$I$1&\"'!\"&\"$C$2:$H$200\"),2,FALSE),\"\")","v":"MDC"},{"$f":"IFERROR(VLOOKUP(B73,INDIRECT(\"'\"&$I$1&\"'!\"&\"$C$2:$H$200\"),3,FALSE),\"\")","v":"M"},{"$f":"IFERROR(VLOOKUP(B73,INDIRECT(\"'\"&$I$1&\"'!\"&\"$C$2:$H$200\"),4,FALSE),\"\")","v":"M"},{"$f":"SUM(LARGE((H73,J73,L73,N73,P73,R73),{1,2,3,4}))","v":114.17932965613798},"",0,0.16459490740740743,114.17932965613798,"",0,"",0,"",0,"",0,1,114.17932965613798,null,{"$f":"COUNTIF(#REF!,'Series Table'!B73)>0","v":{"$error":"#REF!"}}]
[72,"Will Feline",{"$f":"IFERROR(VLOOKUP(B74,INDIRECT(\"'\"&$I$1&\"'!\"&\"$C$2:$H$200\"),2,FALSE),\"\")","v":"Stubbington Green"},{"$f":"IFERROR(VLOOKUP(B74,INDIRECT(\"'\"&$I$1&\"'!\"&\"$C$2:$H$200\"),3,FALSE),\"\")","v":"M"},{"$f":"IFERROR(VLOOKUP(B74,INDIRECT(\"'\"&$I$1&\"'!\"&\"$C$2:$H$200\"),4,FALSE),\"\")","v":"M"},{"$f":"SUM(LARGE((H74,J74,L74,N74,P74,R74),{1,2,3,4}))","v":114.04656439718539},"",0,0.16484953703703703,114.04656439718539,"",0,"",0,"",0,"",0,1,114.04656439718539,null,{"$f":"COUNTIF(#REF!,'Series Table'!B74)>0","v":{"$error":"#REF!"}}]
[73,"Alun Wood",{"$f":"IFERROR(VLOOKUP(B75,INDIRECT(\"'\"&$O$1&\"'!\"&\"$C$2:$H$200\"),2,FALSE),\"\")","v":"Mynydd Du"},{"$f":"IFERROR(VLOOKUP(B75,INDIRECT(\"'\"&$O$1&\"'!\"&\"$C$2:$H$200\"),3,FALSE),\"\")","v":"M"},{"$f":"IFERROR(VLOOKUP(B75,INDIRECT(\"'\"&$O$1&\"'!\"&\"$C$2:$H$200\"),4,FALSE),\"\")","v":"M"},{"$f":"SUM(LARGE((H75,J75,L75,N75,P75,R75),{1,2,3,4}))","v":113.55934767681333},"",0,"",0,"",0,"",0,6.2821527777777775E-2,113.55934767681333,"",0,1,113.55934767681333,null,{"$f":"COUNTIF(#REF!,'Series Table'!B75)>0","v":{"$error":"#REF!"}}]
[74,"Andrew Hughes",{"$f":"IFERROR(VLOOKUP(B76,INDIRECT(\"'\"&$I$1&\"'!\"&\"$C$2:$H$200\"),2,FALSE),\"\")","v":"Rhedwyr Preseli"},{"$f":"IFERROR(VLOOKUP(B76,INDIRECT(\"'\"&$I$1&\"'!\"&\"$C$2:$H$200\"),3,FALSE),\"\")","v":"M"},{"$f":"IFERROR(VLOOKUP(B76,INDIRECT(\"'\"&$I$1&\"'!\"&\"$C$2:$H$200\"),4,FALSE),\"\")","v":"M40"},{"$f":"SUM(LARGE((H76,J76,L76,N76,P76,R76),{1,2,3,4}))","v":113.25600762796762},"",0,0.16636574074074076,113.25600762796762,"",0,"",0,"",0,"",0,1,113.25600762796762,null,{"$f":"COUNTIF(#REF!,'Series Table'!B76)>0","v":{"$error":"#REF!"}}]
[75,"Leigh Searle",{"$f":"IFERROR(VLOOKUP(B77,INDIRECT(\"'\"&$I$1&\"'!\"&\"$C$2:$H$200\"),2,FALSE),\"\")","v":"Treorchy"},{"$f":"IFERROR(VLOOKUP(B77,INDIRECT(\"'\"&$I$1&\"'!\"&\"$C$2:$H$200\"),3,FALSE),\"\")","v":"M"},{"$f":"IFERROR(VLOOKUP(B77,INDIRECT(\"'\"&$I$1&\"'!\"&\"$C$2:$H$200\"),4,FALSE),\"\")","v":"M40"},{"$f":"SUM(LARGE((H77,J77,L77,N77,P77,R77),{1,2,3,4}))","v":112.99651189456026},"",0,0.16686342592592593,112.99651189456026,"",0,"",0,"",0,"",0,1,112.99651189456026,null,{"$f":"COUNTIF(#REF!,'Series Table'!B77)>0","v":{"$error":"#REF!"}}]
[76,"Niki Radnedge",{"$f":"IFERROR(VLOOKUP(B78,INDIRECT(\"'\"&$K$1&\"'!\"&\"$C$2:$H$200\"),2,FALSE),\"\")","v":"Unattached"},{"$f":"IFERROR(VLOOKUP(B78,INDIRECT(\"'\"&$K$1&\"'!\"&\"$C$2:$H$200\"),3,FALSE),\"\")","v":"M"},{"$f":"IFERROR(VLOOKUP(B78,INDIRECT(\"'\"&$K$1&\"'!\"&\"$C$2:$H$200\"),4,FALSE),\"\")","v":"M40"},{"$f":"SUM(LARGE((H78,J78,L78,N78,P78,R78),{1,2,3,4}))","v":111.34425813813434},"",0,"",0,"01:33:14",111.34425813813434,"",0,"",0,"",0,1,111.34425813813434,null,{"$f":"COUNTIF(#REF!,'Series Table'!B78)>0","v":{"$error":"#REF!"}}]
[77,"Alex Lewis",{"$f":"IFERROR(VLOOKUP(B79,INDIRECT(\"'\"&$O$1&\"'!\"&\"$C$2:$H$200\"),2,FALSE),\"\")","v":"Neath Harriers"},{"$f":"IFERROR(VLOOKUP(B79,INDIRECT(\"'\"&$O$1&\"'!\"&\"$C$2:$H$200\"),3,FALSE),\"\")","v":"M"},{"$f":"IFERROR(VLOOKUP(B79,INDIRECT(\"'\"&$O$1&\"'!\"&\"$C$2:$H$200\"),4,FALSE),\"\")","v":"M"},{"$f":"SUM(LARGE((H79,J79,L79,N79,P79,R79),{1,2,3,4}))","v":111.16063382825676},"",0,"",0,"",0,"",0,6.4564814814814811E-2,111.16063382825676,"",0,1,111.16063382825676,null,{"$f":"COUNTIF(#REF!,'Series Table'!B79)>0","v":{"$error":"#REF!"}}]
[78,"Mark Bevan",{"$f":"IFERROR(VLOOKUP(B80,INDIRECT(\"'\"&$M$1&\"'!\"&\"$C$2:$H$200\"),2,FALSE),\"\")","v":"Basingstoke & Mid Hants AC"},{"$f":"IFERROR(VLOOKUP(B80,INDIRECT(\"'\"&$M$1&\"'!\"&\"$C$2:$H$200\"),3,FALSE),\"\")","v":"M"},{"$f":"IFERROR(VLOOKUP(B80,INDIRECT(\"'\"&$M$1&\"'!\"&\"$C$2:$H$200\"),4,FALSE),\"\")","v":"M50"},{"$f":"SUM(LARGE((H80,J80,L80,N80,P80,R80),{1,2,3,4}))","v":111.14639220409505},"",0,"",0,"",0,3.1307870370370368E-2,111.14639220409505,"",0,"",0,1,111.14639220409505,null,{"$f":"COUNTIF(#REF!,'Series Table'!B80)>0","v":{"$error":"#REF!"}}]
[79,"Ruben Lightfoot",{"$f":"IFERROR(VLOOKUP(B81,INDIRECT(\"'\"&$I$1&\"'!\"&\"$C$2:$H$200\"),2,FALSE),\"\")","v":"Cwm Cych"},{"$f":"IFERROR(VLOOKUP(B81,INDIRECT(\"'\"&$I$1&\"'!\"&\"$C$2:$H$200\"),3,FALSE),\"\")","v":"M"},{"$f":"IFERROR(VLOOKUP(B81,INDIRECT(\"'\"&$I$1&\"'!\"&\"$C$2:$H$200\"),4,FALSE),\"\")","v":"M"},{"$f":"SUM(LARGE((H81,J81,L81,N81,P81,R81),{1,2,3,4}))","v":110.80588512184231},"",0,0.17106481481481481,110.80588512184231,"",0,"",0,"",0,"",0,1,110.80588512184231,null,{"$f":"COUNTIF(#REF!,'Series Table'!B81)>0","v":{"$error":"#REF!"}}]
[80,"Gavin Brace",{"$f":"IFERROR(VLOOKUP(B82,INDIRECT(\"'\"&$K$1&\"'!\"&\"$C$2:$H$200\"),2,FALSE),\"\")","v":"Lliswerry Runners"},{"$f":"IFERROR(VLOOKUP(B82,INDIRECT(\"'\"&$K$1&\"'!\"&\"$C$2:$H$200\"),3,FALSE),\"\")","v":"M"},{"$f":"IFERROR(VLOOKUP(B82,INDIRECT(\"'\"&$K$1&\"'!\"&\"$C$2:$H$200\"),4,FALSE),\"\")","v":"M"},{"$f":"SUM(LARGE((H82,J82,L82,N82,P82,R82),{1,2,3,4}))","v":110.77371707502617},"",0,"",0,"01:33:50",110.77371707502617,"",0,"",0,"",0,1,110.77371707502617,null,{"$f":"COUNTIF(#REF!,'Series Table'!B82)>0","v":{"$error":"#REF!"}}]
[81,"Andrew Pritchard",{"$f":"IFERROR(VLOOKUP(B83,INDIRECT(\"'\"&$M$1&\"'!\"&\"$C$2:$H$200\"),2,FALSE),\"\")","v":"Buckley Runners"},{"$f":"IFERROR(VLOOKUP(B83,INDIRECT(\"'\"&$M$1&\"'!\"&\"$C$2:$H$200\"),3,FALSE),\"\")","v":"M"},{"$f":"IFERROR(VLOOKUP(B83,INDIRECT(\"'\"&$M$1&\"'!\"&\"$C$2:$H$200\"),4,FALSE),\"\")","v":"M40"},{"$f":"SUM(LARGE((H83,J83,L83,N83,P83,R83),{1,2,3,4}))","v":110.7193693200482},"",0,"",0,"",0,3.1458333333333331E-2,110.7193693200482,"",0,"",0,1,110.7193693200482,null,{"$f":"COUNTIF(#REF!,'Series Table'!B83)>0","v":{"$error":"#REF!"}}]
[82,"Edward Davies",{"$f":"IFERROR(VLOOKUP(B84,INDIRECT(\"'\"&$M$1&\"'!\"&\"$C$2:$H$200\"),2,FALSE),\"\")","v":"Mercia Fell Runners"},{"$f":"IFERROR(VLOOKUP(B84,INDIRECT(\"'\"&$M$1&\"'!\"&\"$C$2:$H$200\"),3,FALSE),\"\")","v":"M"},{"$f":"IFERROR(VLOOKUP(B84,INDIRECT(\"'\"&$M$1&\"'!\"&\"$C$2:$H$200\"),4,FALSE),\"\")","v":"M60"},{"$f":"SUM(LARGE((H84,J84,L84,N84,P84,R84),{1,2,3,4}))","v":110.12810686521406},"",0,"",0,"",0,3.1666666666666669E-2,110.12810686521406,"",0,"",0,1,110.12810686521406,null,{"$f":"COUNTIF(#REF!,'Series Table'!B84)>0","v":{"$error":"#REF!"}}]
[83,"Tasha Sexton",{"$f":"IFERROR(VLOOKUP(B85,INDIRECT(\"'\"&$I$1&\"'!\"&\"$C$2:$H$200\"),2,FALSE),\"\")","v":"Pembrokeshire Harriers"},{"$f":"IFERROR(VLOOKUP(B85,INDIRECT(\"'\"&$I$1&\"'!\"&\"$C$2:$H$200\"),3,FALSE),\"\")","v":"F"},{"$f":"IFERROR(VLOOKUP(B85,INDIRECT(\"'\"&$I$1&\"'!\"&\"$C$2:$H$200\"),4,FALSE),\"\")","v":"F40"},{"$f":"SUM(LARGE((H85,J85,L85,N85,P85,R85),{1,2,3,4}))","v":110.11188490459007},"",0,0.17239583333333333,110.11188490459007,"",0,"",0,"",0,"",0,1,110.11188490459007,null,{"$f":"COUNTIF(#REF!,'Series Table'!B85)>0","v":{"$error":"#REF!"}}]
[84,"Paul Beeson",{"$f":"IFERROR(VLOOKUP(B86,INDIRECT(\"'\"&$I$1&\"'!\"&\"$C$2:$H$200\"),2,FALSE),\"\")","v":"Maldwyn Harriers"},{"$f":"IFERROR(VLOOKUP(B86,INDIRECT(\"'\"&$I$1&\"'!\"&\"$C$2:$H$200\"),3,FALSE),\"\")","v":"M"},{"$f":"IFERROR(VLOOKUP(B86,INDIRECT(\"'\"&$I$1&\"'!\"&\"$C$2:$H$200\"),4,FALSE),\"\")","v":"M50"},{"$f":"SUM(LARGE((H86,J86,L86,N86,P86,R86),{1,2,3,4}))","v":110.09981533559437},"",0,0.17241898148148149,110.09981533559437,"",0,"",0,"",0,"",0,1,110.09981533559437,null,{"$f":"COUNTIF(#REF!,'Series Table'!B86)>0","v":{"$error":"#REF!"}}]
[85,"James Gillanders",{"$f":"IFERROR(VLOOKUP(B87,INDIRECT(\"'\"&$M$1&\"'!\"&\"$C$2:$H$200\"),2,FALSE),\"\")","v":"Serpentine Running Club"},{"$f":"IFERROR(VLOOKUP(B87,INDIRECT(\"'\"&$M$1&\"'!\"&\"$C$2:$H$200\"),3,FALSE),\"\")","v":"M"},{"$f":"IFERROR(VLOOKUP(B87,INDIRECT(\"'\"&$M$1&\"'!\"&\"$C$2:$H$200\"),4,FALSE),\"\")","v":"M"},{"$f":"SUM(LARGE((H87,J87,L87,N87,P87,R87),{1,2,3,4}))","v":110.06241103689915},"",0,"",0,"",0,3.1689814814814816E-2,110.06241103689915,"",0,"",0,1,110.06241103689915,null,{"$f":"COUNTIF(#REF!,'Series Table'!B87)>0","v":{"$error":"#REF!"}}]
[86,"John Keenan",{"$f":"IFERROR(VLOOKUP(B88,INDIRECT(\"'\"&$M$1&\"'!\"&\"$C$2:$H$200\"),2,FALSE),\"\")","v":"London Frontrunners"},{"$f":"IFERROR(VLOOKUP(B88,INDIRECT(\"'\"&$M$1&\"'!\"&\"$C$2:$H$200\"),3,FALSE),\"\")","v":"M"},{"$f":"IFERROR(VLOOKUP(B88,INDIRECT(\"'\"&$M$1&\"'!\"&\"$C$2:$H$200\"),4,FALSE),\"\")","v":"M40"},{"$f":"SUM(LARGE((H88,J88,L88,N88,P88,R88),{1,2,3,4}))","v":109.93101938026936},"",0,"",0,"",0,3.1736111111111111E-2,109.93101938026936,"",0,"",0,1,109.93101938026936,null,{"$f":"COUNTIF(#REF!,'Series Table'!B88)>0","v":{"$error":"#REF!"}}]
[87,"Conrad Rees",{"$f":"IFERROR(VLOOKUP(B89,INDIRECT(\"'\"&$I$1&\"'!\"&\"$C$2:$H$200\"),2,FALSE),\"\")","v":"Manorbier Newton"},{"$f":"IFERROR(VLOOKUP(B89,INDIRECT(\"'\"&$I$1&\"'!\"&\"$C$2:$H$200\"),3,FALSE),\"\")","v":"M"},{"$f":"IFERROR(VLOOKUP(B89,INDIRECT(\"'\"&$I$1&\"'!\"&\"$C$2:$H$200\"),4,FALSE),\"\")","v":"M40"},{"$f":"SUM(LARGE((H89,J89,L89,N89,P89,R89),{1,2,3,4}))","v":109.90670223166332},"",0,0.17278935185185185,109.90670223166332,"",0,"",0,"",0,"",0,1,109.90670223166332,null,{"$f":"COUNTIF(#REF!,'Series Table'!B89)>0","v":{"$error":"#REF!"}}]
[88,"Tom Molleskin",{"$f":"IFERROR(VLOOKUP(B90,INDIRECT(\"'\"&$G$1&\"'!\"&\"$C$2:$H$200\"),2,FALSE),\"\")","v":"Mynydd Du"},{"$f":"IFERROR(VLOOKUP(B90,INDIRECT(\"'\"&$G$1&\"'!\"&\"$C$2:$H$200\"),3,FALSE),\"\")","v":"M"},{"$f":"IFERROR(VLOOKUP(B90,INDIRECT(\"'\"&$G$1&\"'!\"&\"$C$2:$H$200\"),4,FALSE),\"\")","v":"M"},{"$f":"SUM(LARGE((H90,J90,L90,N90,P90,R90),{1,2,3,4}))","v":109.74413446218252},"01:20:15",109.74413446218252,"",0,"",0,"",0,"",0,"",0,1,109.74413446218252,null,{"$f":"COUNTIF(#REF!,'Series Table'!B90)>0","v":{"$error":"#REF!"}}]
[89,"Brad Johnson",{"$f":"IFERROR(VLOOKUP(B91,INDIRECT(\"'\"&$G$1&\"'!\"&\"$C$2:$H$200\"),2,FALSE),\"\")","v":"U/A"},{"$f":"IFERROR(VLOOKUP(B91,INDIRECT(\"'\"&$G$1&\"'!\"&\"$C$2:$H$200\"),3,FALSE),\"\")","v":"M"},{"$f":"IFERROR(VLOOKUP(B91,INDIRECT(\"'\"&$G$1&\"'!\"&\"$C$2:$H$200\"),4,FALSE),\"\")","v":"M"},{"$f":"SUM(LARGE((H91,J91,L91,N91,P91,R91),{1,2,3,4}))","v":109.72538973413731},"01:20:16",109.72538973413731,"",0,"",0,"",0,"",0,"",0,1,109.72538973413731,null,{"$f":"COUNTIF(#REF!,'Series Table'!B91)>0","v":{"$error":"#REF!"}}]
[90,"Patrick Tudor",{"$f":"IFERROR(VLOOKUP(B92,INDIRECT(\"'\"&$K$1&\"'!\"&\"$C$2:$H$200\"),2,FALSE),\"\")","v":"Unattached"},{"$f":"IFERROR(VLOOKUP(B92,INDIRECT(\"'\"&$K$1&\"'!\"&\"$C$2:$H$200\"),3,FALSE),\"\")","v":"M"},{"$f":"IFERROR(VLOOKUP(B92,INDIRECT(\"'\"&$K$1&\"'!\"&\"$C$2:$H$200\"),4,FALSE),\"\")","v":"M"},{"$f":"SUM(LARGE((H92,J92,L92,N92,P92,R92),{1,2,3,4}))","v":109.66433167453802},"",0,"",0,"01:35:00",109.66433167453802,"",0,"",0,"",0,1,109.66433167453802,null,{"$f":"COUNTIF(#REF!,'Series Table'!B92)>0","v":{"$error":"#REF!"}}]
[91,"Sarah Tagg",{"$f":"IFERROR(VLOOKUP(B93,INDIRECT(\"'\"&$I$1&\"'!\"&\"$C$2:$H$200\"),2,FALSE),\"\")","v":"West Coast Tri"},{"$f":"IFERROR(VLOOKUP(B93,INDIRECT(\"'\"&$I$1&\"'!\"&\"$C$2:$H$200\"),3,FALSE),\"\")","v":"F"},{"$f":"IFERROR(VLOOKUP(B93,INDIRECT(\"'\"&$I$1&\"'!\"&\"$C$2:$H$200\"),4,FALSE),\"\")","v":"F40"},{"$f":"SUM(LARGE((H93,J93,L93,N93,P93,R93),{1,2,3,4}))","v":109.63513692926026},"",0,0.17331018518518518,109.63513692926026,"",0,"",0,"",0,"",0,1,109.63513692926026,null,{"$f":"COUNTIF(#REF!,'Series Table'!B93)>0","v":{"$error":"#REF!"}}]
[92,"Wayne Billman",{"$f":"IFERROR(VLOOKUP(B94,INDIRECT(\"'\"&$I$1&\"'!\"&\"$C$2:$H$200\"),2,FALSE),\"\")","v":"Blandford Camp"},{"$f":"IFERROR(VLOOKUP(B94,INDIRECT(\"'\"&$I$1&\"'!\"&\"$C$2:$H$200\"),3,FALSE),\"\")","v":"M"},{"$f":"IFERROR(VLOOKUP(B94,INDIRECT(\"'\"&$I$1&\"'!\"&\"$C$2:$H$200\"),4,FALSE),\"\")","v":"M"},{"$f":"SUM(LARGE((H94,J94,L94,N94,P94,R94),{1,2,3,4}))","v":109.58082386877965},"",0,0.17341435185185183,109.58082386877965,"",0,"",0,"",0,"",0,1,109.58082386877965,null,{"$f":"COUNTIF(#REF!,'Series Table'!B94)>0","v":{"$error":"#REF!"}}]
[93,"Jonny Ashley",{"$f":"IFERROR(VLOOKUP(B95,INDIRECT(\"'\"&$M$1&\"'!\"&\"$C$2:$H$200\"),2,FALSE),\"\")","v":"Unattached"},{"$f":"IFERROR(VLOOKUP(B95,INDIRECT(\"'\"&$M$1&\"'!\"&\"$C$2:$H$200\"),3,FALSE),\"\")","v":"M"},{"$f":"IFERROR(VLOOKUP(B95,INDIRECT(\"'\"&$M$1&\"'!\"&\"$C$2:$H$200\"),4,FALSE),\"\")","v":"M"},{"$f":"SUM(LARGE((H95,J95,L95,N95,P95,R95),{1,2,3,4}))","v":109.50399649622251},"",0,"",0,"",0,3.1886574074074074E-2,109.50399649622251,"",0,"",0,1,109.50399649622251,null,{"$f":"COUNTIF(#REF!,'Series Table'!B95)>0","v":{"$error":"#REF!"}}]
[94,"Martin Everett",{"$f":"IFERROR(VLOOKUP(B96,INDIRECT(\"'\"&$I$1&\"'!\"&\"$C$2:$H$200\"),2,FALSE),\"\")","v":"Narberth"},{"$f":"IFERROR(VLOOKUP(B96,INDIRECT(\"'\"&$I$1&\"'!\"&\"$C$2:$H$200\"),3,FALSE),\"\")","v":"M"},{"$f":"IFERROR(VLOOKUP(B96,INDIRECT(\"'\"&$I$1&\"'!\"&\"$C$2:$H$200\"),4,FALSE),\"\")","v":"M40"},{"$f":"SUM(LARGE((H96,J96,L96,N96,P96,R96),{1,2,3,4}))","v":109.26098029039383},"",0,0.17402777777777778,109.26098029039383,"",0,"",0,"",0,"",0,1,109.26098029039383,null,{"$f":"COUNTIF(#REF!,'Series Table'!B96)>0","v":{"$error":"#REF!"}}]
[95,"Karie Atkins",{"$f":"IFERROR(VLOOKUP(B97,INDIRECT(\"'\"&$G$1&\"'!\"&\"$C$2:$H$200\"),2,FALSE),\"\")","v":"Chepstow"},{"$f":"IFERROR(VLOOKUP(B97,INDIRECT(\"'\"&$G$1&\"'!\"&\"$C$2:$H$200\"),3,FALSE),\"\")","v":"M"},{"$f":"IFERROR(VLOOKUP(B97,INDIRECT(\"'\"&$G$1&\"'!\"&\"$C$2:$H$200\"),4,FALSE),\"\")","v":"M40"},{"$f":"SUM(LARGE((H97,J97,L97,N97,P97,R97),{1,2,3,4}))","v":109.25677153300634},"01:20:41",109.25677153300634,"",0,"",0,"",0,"",0,"",0,1,109.25677153300634,null,{"$f":"COUNTIF(#REF!,'Series Table'!B97)>0","v":{"$error":"#REF!"}}]
[96,"Nigel Davies",{"$f":"IFERROR(VLOOKUP(B98,INDIRECT(\"'\"&$I$1&\"'!\"&\"$C$2:$H$200\"),2,FALSE),\"\")","v":"Sarn Helen"},{"$f":"IFERROR(VLOOKUP(B98,INDIRECT(\"'\"&$I$1&\"'!\"&\"$C$2:$H$200\"),3,FALSE),\"\")","v":"M"},{"$f":"IFERROR(VLOOKUP(B98,INDIRECT(\"'\"&$I$1&\"'!\"&\"$C$2:$H$200\"),4,FALSE),\"\")","v":"M40"},{"$f":"SUM(LARGE((H98,J98,L98,N98,P98,R98),{1,2,3,4}))","v":109.23080636790461},"",0,0.17408564814814817,109.23080636790461,"",0,"",0,"",0,"",0,1,109.23080636790461,null,{"$f":"COUNTIF(#REF!,'Series Table'!B98)>0","v":{"$error":"#REF!"}}]
[97,"Dave Robson",{"$f":"IFERROR(VLOOKUP(B99,INDIRECT(\"'\"&$K$1&\"'!\"&\"$C$2:$H$200\"),2,FALSE),\"\")","v":"Ilkley Harriers"},{"$f":"IFERROR(VLOOKUP(B99,INDIRECT(\"'\"&$K$1&\"'!\"&\"$C$2:$H$200\"),3,FALSE),\"\")","v":"M"},{"$f":"IFERROR(VLOOKUP(B99,INDIRECT(\"'\"&$K$1&\"'!\"&\"$C$2:$H$200\"),4,FALSE),\"\")","v":"M40"},{"$f":"SUM(LARGE((H99,J99,L99,N99,P99,R99),{1,2,3,4}))","v":109.1413357000222},"",0,"",0,"01:35:33",109.1413357000222,"",0,"",0,"",0,1,109.1413357000222,null,{"$f":"COUNTIF(#REF!,'Series Table'!B99)>0","v":{"$error":"#REF!"}}]
[98,"Malcolm O'Brien",{"$f":"IFERROR(VLOOKUP(B100,INDIRECT(\"'\"&$M$1&\"'!\"&\"$C$2:$H$200\"),2,FALSE),\"\")","v":"Unattached"},{"$f":"IFERROR(VLOOKUP(B100,INDIRECT(\"'\"&$M$1&\"'!\"&\"$C$2:$H$200\"),3,FALSE),\"\")","v":"M"},{"$f":"IFERROR(VLOOKUP(B100,INDIRECT(\"'\"&$M$1&\"'!\"&\"$C$2:$H$200\"),4,FALSE),\"\")","v":"M"},{"$f":"SUM(LARGE((H100,J100,L100,N100,P100,R100),{1,2,3,4}))","v":108.55140698565644},"",0,"",0,"",0,3.2222222222222222E-2,108.55140698565644,"",0,"",0,1,108.55140698565644,null,{"$f":"COUNTIF(#REF!,'Series Table'!B100)>0","v":{"$error":"#REF!"}}]
[99,"Evan Davies",{"$f":"IFERROR(VLOOKUP(B101,INDIRECT(\"'\"&$M$1&\"'!\"&\"$C$2:$H$200\"),2,FALSE),\"\")","v":"Unattached"},{"$f":"IFERROR(VLOOKUP(B101,INDIRECT(\"'\"&$M$1&\"'!\"&\"$C$2:$H$200\"),3,FALSE),\"\")","v":"M"},{"$f":"IFERROR(VLOOKUP(B101,INDIRECT(\"'\"&$M$1&\"'!\"&\"$C$2:$H$200\"),4,FALSE),\"\")","v":"M"},{"$f":"SUM(LARGE((H101,J101,L101,N101,P101,R101),{1,2,3,4}))","v":108.55140698565644},"",0,"",0,"",0,3.2222222222222222E-2,108.55140698565644,"",0,"",0,1,108.55140698565644,null,{"$f":"COUNTIF(#REF!,'Series Table'!B101)>0","v":{"$error":"#REF!"}}]
[100,"Mark Nelson",{"$f":"IFERROR(VLOOKUP(B102,INDIRECT(\"'\"&$K$1&\"'!\"&\"$C$2:$H$200\"),2,FALSE),\"\")","v":"Unattached"},{"$f":"IFERROR(VLOOKUP(B102,INDIRECT(\"'\"&$K$1&\"'!\"&\"$C$2:$H$200\"),3,FALSE),\"\")","v":"M"},{"$f":"IFERROR(VLOOKUP(B102,INDIRECT(\"'\"&$K$1&\"'!\"&\"$C$2:$H$200\"),4,FALSE),\"\")","v":"M40"},{"$f":"SUM(LARGE((H102,J102,L102,N102,P102,R102),{1,2,3,4}))","v":108.3806142825446},"",0,"",0,"01:36:21",108.3806142825446,"",0,"",0,"",0,1,108.3806142825446,null,{"$f":"COUNTIF(#REF!,'Series Table'!B102)>0","v":{"$error":"#REF!"}}]
[101,"John Hallett",{"$f":"IFERROR(VLOOKUP(B103,INDIRECT(\"'\"&$G$1&\"'!\"&\"$C$2:$H$200\"),2,FALSE),\"\")","v":"MDC"},{"$f":"IFERROR(VLOOKUP(B103,INDIRECT(\"'\"&$G$1&\"'!\"&\"$C$2:$H$200\"),3,FALSE),\"\")","v":"M"},{"$f":"IFERROR(VLOOKUP(B103,INDIRECT(\"'\"&$G$1&\"'!\"&\"$C$2:$H$200\"),4,FALSE),\"\")","v":"M"},{"$f":"SUM(LARGE((H103,J103,L103,N103,P103,R103),{1,2,3,4}))","v":108.18832203442783},"01:21:38",108.18832203442783,"",0,"",0,"",0,"",0,"",0,1,108.18832203442783,null,{"$f":"COUNTIF(#REF!,'Series Table'!B103)>0","v":{"$error":"#REF!"}}]
[102,"Mike Johnson",{"$f":"IFERROR(VLOOKUP(B104,INDIRECT(\"'\"&$K$1&\"'!\"&\"$C$2:$H$200\"),2,FALSE),\"\")","v":"Unattached"},{"$f":"IFERROR(VLOOKUP(B104,INDIRECT(\"'\"&$K$1&\"'!\"&\"$C$2:$H$200\"),3,FALSE),\"\")","v":"M"},{"$f":"IFERROR(VLOOKUP(B104,INDIRECT(\"'\"&$K$1&\"'!\"&\"$C$2:$H$200\"),4,FALSE),\"\")","v":"M50"},{"$f":"SUM(LARGE((H104,J104,L104,N104,P104,R104),{1,2,3,4}))","v":107.9685568480776},"",0,"",0,"01:36:47",107.9685568480776,"",0,"",0,"",0,1,107.9685568480776,null,{"$f":"COUNTIF(#REF!,'Series Table'!B104)>0","v":{"$error":"#REF!"}}]
[103,"Andy Creber",{"$f":"IFERROR(VLOOKUP(B105,INDIRECT(\"'\"&$O$1&\"'!\"&\"$C$2:$H$200\"),2,FALSE),\"\")","v":"Chepstow Harriers"},{"$f":"IFERROR(VLOOKUP(B105,INDIRECT(\"'\"&$O$1&\"'!\"&\"$C$2:$H$200\"),3,FALSE),\"\")","v":"M"},{"$f":"IFERROR(VLOOKUP(B105,INDIRECT(\"'\"&$O$1&\"'!\"&\"$C$2:$H$200\"),4,FALSE),\"\")","v":"M50"},{"$f":"SUM(LARGE((H105,J105,L105,N105,P105,R105),{1,2,3,4}))","v":107.92471119588249},"",0,"",0,"",0,"",0,6.6916550925925924E-2,107.92471119588249,"",0,1,107.92471119588249,null,{"$f":"COUNTIF(#REF!,'Series Table'!B105)>0","v":{"$error":"#REF!"}}]
[104,"John Cherry",{"$f":"IFERROR(VLOOKUP(B106,INDIRECT(\"'\"&$I$1&\"'!\"&\"$C$2:$H$200\"),2,FALSE),\"\")","v":"Upper Killay"},{"$f":"IFERROR(VLOOKUP(B106,INDIRECT(\"'\"&$I$1&\"'!\"&\"$C$2:$H$200\"),3,FALSE),\"\")","v":"M"},{"$f":"IFERROR(VLOOKUP(B106,INDIRECT(\"'\"&$I$1&\"'!\"&\"$C$2:$H$200\"),4,FALSE),\"\")","v":"M40"},{"$f":"SUM(LARGE((H106,J106,L106,N106,P106,R106),{1,2,3,4}))","v":107.79452765741735},"",0,0.17684027777777778,107.79452765741735,"",0,"",0,"",0,"",0,1,107.79452765741735,null,{"$f":"COUNTIF(#REF!,'Series Table'!B106)>0","v":{"$error":"#REF!"}}]
[105,"Andy Vaudin",{"$f":"IFERROR(VLOOKUP(B107,INDIRECT(\"'\"&$O$1&\"'!\"&\"$C$2:$H$200\"),2,FALSE),\"\")","v":"Unattached"},{"$f":"IFERROR(VLOOKUP(B107,INDIRECT(\"'\"&$O$1&\"'!\"&\"$C$2:$H$200\"),3,FALSE),\"\")","v":"M"},{"$f":"IFERROR(VLOOKUP(B107,INDIRECT(\"'\"&$O$1&\"'!\"&\"$C$2:$H$200\"),4,FALSE),\"\")","v":"M50"},{"$f":"SUM(LARGE((H107,J107,L107,N107,P107,R107),{1,2,3,4}))","v":107.57609981528961},"",0,"",0,"",0,"",0,6.71699074074074E-2,107.57609981528961,"",0,1,107.57609981528961,null,{"$f":"COUNTIF(#REF!,'Series Table'!B107)>0","v":{"$error":"#REF!"}}]
[106,"Ben Jozefiak",{"$f":"IFERROR(VLOOKUP(B108,INDIRECT(\"'\"&$K$1&\"'!\"&\"$C$2:$H$200\"),2,FALSE),\"\")","v":"Eryri Harriers"},{"$f":"IFERROR(VLOOKUP(B108,INDIRECT(\"'\"&$K$1&\"'!\"&\"$C$2:$H$200\"),3,FALSE),\"\")","v":"M"},{"$f":"IFERROR(VLOOKUP(B108,INDIRECT(\"'\"&$K$1&\"'!\"&\"$C$2:$H$200\"),4,FALSE),\"\")","v":"M"},{"$f":"SUM(LARGE((H108,J108,L108,N108,P108,R108),{1,2,3,4}))","v":107.39801578496939},"",0,"",0,"01:37:23",107.39801578496939,"",0,"",0,"",0,1,107.39801578496939,null,{"$f":"COUNTIF(#REF!,'Series Table'!B108)>0","v":{"$error":"#REF!"}}]
[107,"Glyn Fletcher",{"$f":"IFERROR(VLOOKUP(B109,INDIRECT(\"'\"&$I$1&\"'!\"&\"$C$2:$H$200\"),2,FALSE),\"\")","v":"Maldwyn Harriers"},{"$f":"IFERROR(VLOOKUP(B109,INDIRECT(\"'\"&$I$1&\"'!\"&\"$C$2:$H$200\"),3,FALSE),\"\")","v":"M"},{"$f":"IFERROR(VLOOKUP(B109,INDIRECT(\"'\"&$I$1&\"'!\"&\"$C$2:$H$200\"),4,FALSE),\"\")","v":"M50"},{"$f":"SUM(LARGE((H109,J109,L109,N109,P109,R109),{1,2,3,4}))","v":107.37209274256819},"",0,0.17765046296296297,107.37209274256819,"",0,"",0,"",0,"",0,1,107.37209274256819,null,{"$f":"COUNTIF(#REF!,'Series Table'!B109)>0","v":{"$error":"#REF!"}}]
[108,"Jonathan Moscrop",{"$f":"IFERROR(VLOOKUP(B110,INDIRECT(\"'\"&$M$1&\"'!\"&\"$C$2:$H$200\"),2,FALSE),\"\")","v":"Serpentine Running Club"},{"$f":"IFERROR(VLOOKUP(B110,INDIRECT(\"'\"&$M$1&\"'!\"&\"$C$2:$H$200\"),3,FALSE),\"\")","v":"M"},{"$f":"IFERROR(VLOOKUP(B110,INDIRECT(\"'\"&$M$1&\"'!\"&\"$C$2:$H$200\"),4,FALSE),\"\")","v":"M40"},{"$f":"SUM(LARGE((H110,J110,L110,N110,P110,R110),{1,2,3,4}))","v":107.27033833351585},"",0,"",0,"",0,3.2673611111111105E-2,107.27033833351585,"",0,"",0,1,107.27033833351585,null,{"$f":"COUNTIF(#REF!,'Series Table'!B110)>0","v":{"$error":"#REF!"}}]
[109,"Anderson Hirst",{"$f":"IFERROR(VLOOKUP(B111,INDIRECT(\"'\"&$M$1&\"'!\"&\"$C$2:$H$200\"),2,FALSE),\"\")","v":"Unattached"},{"$f":"IFERROR(VLOOKUP(B111,INDIRECT(\"'\"&$M$1&\"'!\"&\"$C$2:$H$200\"),3,FALSE),\"\")","v":"M"},{"$f":"IFERROR(VLOOKUP(B111,INDIRECT(\"'\"&$M$1&\"'!\"&\"$C$2:$H$200\"),4,FALSE),\"\")","v":"M50"},{"$f":"SUM(LARGE((H111,J111,L111,N111,P111,R111),{1,2,3,4}))","v":107.23749041935839},"",0,"",0,"",0,3.2685185185185185E-2,107.23749041935839,"",0,"",0,1,107.23749041935839,null,{"$f":"COUNTIF(#REF!,'Series Table'!B111)>0","v":{"$error":"#REF!"}}]
[110,"Nigel Eldridge",{"$f":"IFERROR(VLOOKUP(B112,INDIRECT(\"'\"&$M$1&\"'!\"&\"$C$2:$H$200\"),2,FALSE),\"\")","v":"Ryde Harriers"},{"$f":"IFERROR(VLOOKUP(B112,INDIRECT(\"'\"&$M$1&\"'!\"&\"$C$2:$H$200\"),3,FALSE),\"\")","v":"M"},{"$f":"IFERROR(VLOOKUP(B112,INDIRECT(\"'\"&$M$1&\"'!\"&\"$C$2:$H$200\"),4,FALSE),\"\")","v":"M40"},{"$f":"SUM(LARGE((H112,J112,L112,N112,P112,R112),{1,2,3,4}))","v":107.23749041935839},"",0,"",0,"",0,3.2685185185185185E-2,107.23749041935839,"",0,"",0,1,107.23749041935839,null,{"$f":"COUNTIF(#REF!,'Series Table'!B112)>0","v":{"$error":"#REF!"}}]
[111,"Paul Dodd",{"$f":"IFERROR(VLOOKUP(B113,INDIRECT(\"'\"&$M$1&\"'!\"&\"$C$2:$H$200\"),2,FALSE),\"\")","v":"Chepstow Harriers"},{"$f":"IFERROR(VLOOKUP(B113,INDIRECT(\"'\"&$M$1&\"'!\"&\"$C$2:$H$200\"),3,FALSE),\"\")","v":"M"},{"$f":"IFERROR(VLOOKUP(B113,INDIRECT(\"'\"&$M$1&\"'!\"&\"$C$2:$H$200\"),4,FALSE),\"\")","v":"M50"},{"$f":"SUM(LARGE((H113,J113,L113,N113,P113,R113),{1,2,3,4}))","v":107.17179459104349},"",0,"",0,"",0,3.2708333333333332E-2,107.17179459104349,"",0,"",0,1,107.17179459104349,null,{"$f":"COUNTIF(#REF!,'Series Table'!B113)>0","v":{"$error":"#REF!"}}]
[112,"Gemma Moore",{"$f":"IFERROR(VLOOKUP(B114,INDIRECT(\"'\"&$M$1&\"'!\"&\"$C$2:$H$200\"),2,FALSE),\"\")","v":"North Wales Road Runners"},{"$f":"IFERROR(VLOOKUP(B114,INDIRECT(\"'\"&$M$1&\"'!\"&\"$C$2:$H$200\"),3,FALSE),\"\")","v":"F"},{"$f":"IFERROR(VLOOKUP(B114,INDIRECT(\"'\"&$M$1&\"'!\"&\"$C$2:$H$200\"),4,FALSE),\"\")","v":"F"},{"$f":"SUM(LARGE((H114,J114,L114,N114,P114,R114),{1,2,3,4}))","v":107.13894667688604},"",0,"",0,"",0,3.2719907407407406E-2,107.13894667688604,"",0,"",0,1,107.13894667688604,null,{"$f":"COUNTIF(#REF!,'Series Table'!B114)>0","v":{"$error":"#REF!"}}]
[113,"Braddon Johnson",{"$f":"IFERROR(VLOOKUP(B115,INDIRECT(\"'\"&$I$1&\"'!\"&\"$C$2:$H$200\"),2,FALSE),\"\")","v":"Stonehouse"},{"$f":"IFERROR(VLOOKUP(B115,INDIRECT(\"'\"&$I$1&\"'!\"&\"$C$2:$H$200\"),3,FALSE),\"\")","v":"M"},{"$f":"IFERROR(VLOOKUP(B115,INDIRECT(\"'\"&$I$1&\"'!\"&\"$C$2:$H$200\"),4,FALSE),\"\")","v":"M"},{"$f":"SUM(LARGE((H115,J115,L115,N115,P115,R115),{1,2,3,4}))","v":107.08845787116942},"",0,0.17819444444444443,107.08845787116942,"",0,"",0,"",0,"",0,1,107.08845787116942,null,{"$f":"COUNTIF(#REF!,'Series Table'!B115)>0","v":{"$error":"#REF!"}}]
[114,"George Fisher",{"$f":"IFERROR(VLOOKUP(B116,INDIRECT(\"'\"&$G$1&\"'!\"&\"$C$2:$H$200\"),2,FALSE),\"\")","v":"1 Rifles"},{"$f":"IFERROR(VLOOKUP(B116,INDIRECT(\"'\"&$G$1&\"'!\"&\"$C$2:$H$200\"),3,FALSE),\"\")","v":"M"},{"$f":"IFERROR(VLOOKUP(B116,INDIRECT(\"'\"&$G$1&\"'!\"&\"$C$2:$H$200\"),4,FALSE),\"\")","v":"U23"},{"$f":"SUM(LARGE((H116,J116,L116,N116,P116,R116),{1,2,3,4}))","v":106.95116998344218},"01:22:44",106.95116998344218,"",0,"",0,"",0,"",0,"",0,1,106.95116998344218,null,{"$f":"COUNTIF(#REF!,'Series Table'!B116)>0","v":{"$error":"#REF!"}}]
[115,"Sophie Noot",{"$f":"IFERROR(VLOOKUP(B117,INDIRECT(\"'\"&$I$1&\"'!\"&\"$C$2:$H$200\"),2,FALSE),\"\")","v":"Team Cemais"},{"$f":"IFERROR(VLOOKUP(B117,INDIRECT(\"'\"&$I$1&\"'!\"&\"$C$2:$H$200\"),3,FALSE),\"\")","v":"F"},{"$f":"IFERROR(VLOOKUP(B117,INDIRECT(\"'\"&$I$1&\"'!\"&\"$C$2:$H$200\"),4,FALSE),\"\")","v":"F40"},{"$f":"SUM(LARGE((H117,J117,L117,N117,P117,R117),{1,2,3,4}))","v":106.43066636090425},"",0,0.17945601851851853,106.43066636090425,"",0,"",0,"",0,"",0,1,106.43066636090425,null,{"$f":"COUNTIF(#REF!,'Series Table'!B117)>0","v":{"$error":"#REF!"}}]
[116,"Andrew Clement","Trots","M","M50",{"$f":"SUM(LARGE((H118,J118,L118,N118,P118,R118),{1,2,3,4}))","v":106.35221416243228},"",0,0.17960648148148148,106.35221416243228,"",0,"",0,"",0,"",0,1,106.35221416243228,null,{"$f":"COUNTIF(#REF!,'Series Table'!B118)>0","v":{"$error":"#REF!"}}]
[117,"James Roberts","Pemb Dock","M","M",{"$f":"SUM(LARGE((H119,J119,L119,N119,P119,R119),{1,2,3,4}))","v":106.15306627400336},"",0,0.17998842592592593,106.15306627400336,"",0,"",0,"",0,"",0,1,106.15306627400336,null,{"$f":"COUNTIF(#REF!,'Series Table'!B119)>0","v":{"$error":"#REF!"}}]
[118,"Llifon Howell","West Coast Tri","M","M",{"$f":"SUM(LARGE((H120,J120,L120,N120,P120,R120),{1,2,3,4}))","v":106.1168575670163},"",0,0.18005787037037035,106.1168575670163,"",0,"",0,"",0,"",0,1,106.1168575670163,null,{"$f":"COUNTIF(#REF!,'Series Table'!B120)>0","v":{"$error":"#REF!"}}]
[119,"Heddwyn Evans","Cardigan Running Club","M","M",{"$f":"SUM(LARGE((H121,J121,L121,N121,P121,R121),{1,2,3,4}))","v":106.0685792910335},"",0,0.18015046296296297,106.0685792910335,"",0,"",0,"",0,"",0,1,106.0685792910335,null,{"$f":"COUNTIF(#REF!,'Series Table'!B121)>0","v":{"$error":"#REF!"}}]
[120,"Michael Smith","Worcester","M","M",{"$f":"SUM(LARGE((H122,J122,L122,N122,P122,R122),{1,2,3,4}))","v":105.69442265216709},"",0,0.18086805555555555,105.69442265216709,"",0,"",0,"",0,"",0,1,105.69442265216709,null,{"$f":"COUNTIF(#REF!,'Series Table'!B122)>0","v":{"$error":"#REF!"}}]
[121,"Niki Morgan",{"$f":"IFERROR(VLOOKUP(B123,INDIRECT(\"'\"&$O$1&\"'!\"&\"$C$2:$H$200\"),2,FALSE),\"\")","v":"Mynydd Du"},{"$f":"IFERROR(VLOOKUP(B123,INDIRECT(\"'\"&$O$1&\"'!\"&\"$C$2:$H$200\"),3,FALSE),\"\")","v":"F"},{"$f":"IFERROR(VLOOKUP(B123,INDIRECT(\"'\"&$O$1&\"'!\"&\"$C$2:$H$200\"),4,FALSE),\"\")","v":"F50"},{"$f":"SUM(LARGE((H123,J123,L123,N123,P123,R123),{1,2,3,4}))","v":105.54542657913603},"",0,"",0,"",0,"",0,6.8645717592592595E-2,105.54542657913603,"",0,1,105.54542657913603,null,{"$f":"COUNTIF(#REF!,'Series Table'!B123)>0","v":{"$error":"#REF!"}}]
[122,"Jonathan Roberts",{"$f":"IFERROR(VLOOKUP(B124,INDIRECT(\"'\"&$I$1&\"'!\"&\"$C$2:$H$200\"),2,FALSE),\"\")","v":"Pemb Dock"},{"$f":"IFERROR(VLOOKUP(B124,INDIRECT(\"'\"&$I$1&\"'!\"&\"$C$2:$H$200\"),3,FALSE),\"\")","v":"M"},{"$f":"IFERROR(VLOOKUP(B124,INDIRECT(\"'\"&$I$1&\"'!\"&\"$C$2:$H$200\"),4,FALSE),\"\")","v":"M"},{"$f":"SUM(LARGE((H124,J124,L124,N124,P124,R124),{1,2,3,4}))","v":105.45303127225327},"",0,0.18133101851851852,105.45303127225327,"",0,"",0,"",0,"",0,1,105.45303127225327,null,{"$f":"COUNTIF(#REF!,'Series Table'!B124)>0","v":{"$error":"#REF!"}}]
[123,"Louise Barker",{"$f":"IFERROR(VLOOKUP(B125,INDIRECT(\"'\"&$I$1&\"'!\"&\"$C$2:$H$200\"),2,FALSE),\"\")","v":"Aberystwyth Ac"},{"$f":"IFERROR(VLOOKUP(B125,INDIRECT(\"'\"&$I$1&\"'!\"&\"$C$2:$H$200\"),3,FALSE),\"\")","v":"F"},{"$f":"IFERROR(VLOOKUP(B125,INDIRECT(\"'\"&$I$1&\"'!\"&\"$C$2:$H$200\"),4,FALSE),\"\")","v":"F40"},{"$f":"SUM(LARGE((H125,J125,L125,N125,P125,R125),{1,2,3,4}))","v":105.33837036679421},"",0,0.18155092592592592,105.33837036679421,"",0,"",0,"",0,"",0,1,105.33837036679421,null,{"$f":"COUNTIF(#REF!,'Series Table'!B125)>0","v":{"$error":"#REF!"}}]
[124,"Alex Banks",{"$f":"IFERROR(VLOOKUP(B126,INDIRECT(\"'\"&$K$1&\"'!\"&\"$C$2:$H$200\"),2,FALSE),\"\")","v":"Bristol & West Ac"},{"$f":"IFERROR(VLOOKUP(B126,INDIRECT(\"'\"&$K$1&\"'!\"&\"$C$2:$H$200\"),3,FALSE),\"\")","v":"M"},{"$f":"IFERROR(VLOOKUP(B126,INDIRECT(\"'\"&$K$1&\"'!\"&\"$C$2:$H$200\"),4,FALSE),\"\")","v":"M"},{"$f":"SUM(LARGE((H126,J126,L126,N126,P126,R126),{1,2,3,4}))","v":105.25848679831373},"",0,"",0,"01:39:38",105.25848679831373,"",0,"",0,"",0,1,105.25848679831373,null,{"$f":"COUNTIF(#REF!,'Series Table'!B126)>0","v":{"$error":"#REF!"}}]
[125,"Phil Carter",{"$f":"IFERROR(VLOOKUP(B127,INDIRECT(\"'\"&$I$1&\"'!\"&\"$C$2:$H$200\"),2,FALSE),\"\")","v":"Pembrokeshire Tri"},{"$f":"IFERROR(VLOOKUP(B127,INDIRECT(\"'\"&$I$1&\"'!\"&\"$C$2:$H$200\"),3,FALSE),\"\")","v":"M"},{"$f":"IFERROR(VLOOKUP(B127,INDIRECT(\"'\"&$I$1&\"'!\"&\"$C$2:$H$200\"),4,FALSE),\"\")","v":"M50"},{"$f":"SUM(LARGE((H127,J127,L127,N127,P127,R127),{1,2,3,4}))","v":104.81334411548163},"",0,0.18255787037037038,104.81334411548163,"",0,"",0,"",0,"",0,1,104.81334411548163,null,{"$f":"COUNTIF(#REF!,'Series Table'!B127)>0","v":{"$error":"#REF!"}}]
[126,"Rodney Parker",{"$f":"IFERROR(VLOOKUP(B128,INDIRECT(\"'\"&$M$1&\"'!\"&\"$C$2:$H$200\"),2,FALSE),\"\")","v":"Ryde Harriers"},{"$f":"IFERROR(VLOOKUP(B128,INDIRECT(\"'\"&$M$1&\"'!\"&\"$C$2:$H$200\"),3,FALSE),\"\")","v":"M"},{"$f":"IFERROR(VLOOKUP(B128,INDIRECT(\"'\"&$M$1&\"'!\"&\"$C$2:$H$200\"),4,FALSE),\"\")","v":"M40"},{"$f":"SUM(LARGE((H128,J128,L128,N128,P128,R128),{1,2,3,4}))","v":104.77389685754954},"",0,"",0,"",0,3.3553240740740745E-2,104.77389685754954,"",0,"",0,1,104.77389685754954,null,{"$f":"COUNTIF(#REF!,'Series Table'!B128)>0","v":{"$error":"#REF!"}}]
[127,"Steven Plumb",{"$f":"IFERROR(VLOOKUP(B129,INDIRECT(\"'\"&$I$1&\"'!\"&\"$C$2:$H$200\"),2,FALSE),\"\")","v":"Carmarthen"},{"$f":"IFERROR(VLOOKUP(B129,INDIRECT(\"'\"&$I$1&\"'!\"&\"$C$2:$H$200\"),3,FALSE),\"\")","v":"M"},{"$f":"IFERROR(VLOOKUP(B129,INDIRECT(\"'\"&$I$1&\"'!\"&\"$C$2:$H$200\"),4,FALSE),\"\")","v":"M"},{"$f":"SUM(LARGE((H129,J129,L129,N129,P129,R129),{1,2,3,4}))","v":104.68057885652904},"",0,0.18281250000000002,104.68057885652904,"",0,"",0,"",0,"",0,1,104.68057885652904,null,{"$f":"COUNTIF(#REF!,'Series Table'!B129)>0","v":{"$error":"#REF!"}}]
[128,"Jason Wilkins",{"$f":"IFERROR(VLOOKUP(B130,INDIRECT(\"'\"&$I$1&\"'!\"&\"$C$2:$H$200\"),2,FALSE),\"\")","v":"Rhedwyr Preseli"},{"$f":"IFERROR(VLOOKUP(B130,INDIRECT(\"'\"&$I$1&\"'!\"&\"$C$2:$H$200\"),3,FALSE),\"\")","v":"M"},{"$f":"IFERROR(VLOOKUP(B130,INDIRECT(\"'\"&$I$1&\"'!\"&\"$C$2:$H$200\"),4,FALSE),\"\")","v":"M40"},{"$f":"SUM(LARGE((H130,J130,L130,N130,P130,R130),{1,2,3,4}))","v":104.57195273556783},"",0,0.18302083333333333,104.57195273556783,"",0,"",0,"",0,"",0,1,104.57195273556783,null,{"$f":"COUNTIF(#REF!,'Series Table'!B130)>0","v":{"$error":"#REF!"}}]
[129,"Harry Rann",{"$f":"IFERROR(VLOOKUP(B131,INDIRECT(\"'\"&$M$1&\"'!\"&\"$C$2:$H$200\"),2,FALSE),\"\")","v":"Godshill Massive"},{"$f":"IFERROR(VLOOKUP(B131,INDIRECT(\"'\"&$M$1&\"'!\"&\"$C$2:$H$200\"),3,FALSE),\"\")","v":"M"},{"$f":"IFERROR(VLOOKUP(B131,INDIRECT(\"'\"&$M$1&\"'!\"&\"$C$2:$H$200\"),4,FALSE),\"\")","v":"M"},{"$f":"SUM(LARGE((H131,J131,L131,N131,P131,R131),{1,2,3,4}))","v":104.31402605934525},{"$f":"IFERROR(VLOOKUP(B131,INDIRECT(\"'\"&$G$1&\"'!\"&\"$C$2:$H$200\"),5,FALSE),\"\")","v":""},{"$f":"IFERROR(VLOOKUP(B131,INDIRECT(\"'\"&$G$1&\"'!\"&\"$C$2:$H$200\"),6,FALSE),0)","v":0},{"$f":"IFERROR(VLOOKUP(B131,INDIRECT(\"'\"&$I$1&\"'!\"&\"$C$2:$G$200\"),5,FALSE),\"\")","v":""},{"$f":"IFERROR(VLOOKUP(B131,INDIRECT(\"'\"&$I$1&\"'!\"&\"$C$2:$H$200\"),6,FALSE),0)","v":0},{"$f":"IFERROR(VLOOKUP(B131,INDIRECT(\"'\"&$K$1&\"'!\"&\"$C$2:$H$200\"),5,FALSE),\"\")","v":""},{"$f":"IFERROR(VLOOKUP(B131,INDIRECT(\"'\"&$K$1&\"'!\"&\"$C$2:$H$200\"),6,FALSE),0)","v":0},{"$f":"IFERROR(VLOOKUP(B131,INDIRECT(\"'\"&$M$1&\"'!\"&\"$C$2:$h$200\"),5,FALSE),\"\")","v":3.3715277777777775E-2},{"$f":"IFERROR(VLOOKUP(B131,INDIRECT(\"'\"&$M$1&\"'!\"&\"$C$2:$h$200\"),6,FALSE),0)","v":104.31402605934525},{"$f":"IFERROR(VLOOKUP(B131,INDIRECT(\"'\"&$O$1&\"'!\"&\"$C$2:$h$200\"),5,FALSE),\"\")","v":""},{"$f":"IFERROR(VLOOKUP(B131,INDIRECT(\"'\"&$O$1&\"'!\"&\"$C$2:$h$200\"),6,FALSE),0)","v":0},{"$f":"IFERROR(VLOOKUP(B131,INDIRECT(\"'\"&$Q$1&\"'!\"&\"$C$2:$h$200\"),5,FALSE),\"\")","v":""},{"$f":"IFERROR(VLOOKUP(B131,INDIRECT(\"'\"&$Q$1&\"'!\"&\"$C$2:$h$200\"),6,FALSE),0)","v":0},{"$f":"6-COUNTIF(G131:Q131,\"\")","v":1},{"$f":"F131/IF(S131>4,4,S131)","v":104.31402605934525},null,{"$f":"COUNTIF(#REF!,'Series Table'!B131)>0","v":{"$error":"#REF!"}}]
[{"$f":"ROW(A130)","v":130},"Richard Love",{"$f":"IFERROR(VLOOKUP(B132,INDIRECT(\"'\"&$M$1&\"'!\"&\"$C$2:$H$200\"),2,FALSE),\"\")","v":"Mercia Fell Runners"},{"$f":"IFERROR(VLOOKUP(B132,INDIRECT(\"'\"&$M$1&\"'!\"&\"$C$2:$H$200\"),3,FALSE),\"\")","v":"M"},{"$f":"IFERROR(VLOOKUP(B132,INDIRECT(\"'\"&$M$1&\"'!\"&\"$C$2:$H$200\"),4,FALSE),\"\")","v":"M50"},{"$f":"SUM(LARGE((H132,J132,L132,N132,P132,R132),{1,2,3,4}))","v":103.75561151866857},"",0,"",0,"",0,3.3912037037037039E-2,103.75561151866857,"",0,"",0,1,103.75561151866857,null,{"$f":"COUNTIF(#REF!,'Series Table'!B132)>0","v":{"$error":"#REF!"}}]
[131,"Michael Cope",{"$f":"IFERROR(VLOOKUP(B133,INDIRECT(\"'\"&$K$1&\"'!\"&\"$C$2:$H$200\"),2,FALSE),\"\")","v":"Mynydd Du"},{"$f":"IFERROR(VLOOKUP(B133,INDIRECT(\"'\"&$K$1&\"'!\"&\"$C$2:$H$200\"),3,FALSE),\"\")","v":"M"},{"$f":"IFERROR(VLOOKUP(B133,INDIRECT(\"'\"&$K$1&\"'!\"&\"$C$2:$H$200\"),4,FALSE),\"\")","v":"M40"},{"$f":"SUM(LARGE((H133,J133,L133,N133,P133,R133),{1,2,3,4}))","v":103.72119560049447},"",0,"",0,"01:41:15",103.72119560049447,"",0,"",0,"",0,1,103.72119560049447,null,{"$f":"COUNTIF(#REF!,'Series Table'!B133)>0","v":{"$error":"#REF!"}}]
[132,"Crispin Flower",{"$f":"IFERROR(VLOOKUP(B134,INDIRECT(\"'\"&$K$1&\"'!\"&\"$C$2:$H$200\"),2,FALSE),\"\")","v":"Mynydd Du"},{"$f":"IFERROR(VLOOKUP(B134,INDIRECT(\"'\"&$K$1&\"'!\"&\"$C$2:$H$200\"),3,FALSE),\"\")","v":"M"},{"$f":"IFERROR(VLOOKUP(B134,INDIRECT(\"'\"&$K$1&\"'!\"&\"$C$2:$H$200\"),4,FALSE),\"\")","v":"M40"},{"$f":"SUM(LARGE((H134,J134,L134,N134,P134,R134),{1,2,3,4}))","v":103.64195378617387},"",0,"",0,"01:41:20",103.64195378617387,"",0,"",0,"",0,1,103.64195378617387,null,{"$f":"COUNTIF(#REF!,'Series Table'!B134)>0","v":{"$error":"#REF!"}}]
[133,"Luke Baines",{"$f":"IFERROR(VLOOKUP(B135,INDIRECT(\"'\"&$I$1&\"'!\"&\"$C$2:$H$200\"),2,FALSE),\"\")","v":"Narberth"},{"$f":"IFERROR(VLOOKUP(B135,INDIRECT(\"'\"&$I$1&\"'!\"&\"$C$2:$H$200\"),3,FALSE),\"\")","v":"M"},{"$f":"IFERROR(VLOOKUP(B135,INDIRECT(\"'\"&$I$1&\"'!\"&\"$C$2:$H$200\"),4,FALSE),\"\")","v":"M"},{"$f":"SUM(LARGE((H135,J135,L135,N135,P135,R135),{1,2,3,4}))","v":103.15981316307197},"",0,0.18572916666666664,103.15981316307197,"",0,"",0,"",0,"",0,1,103.15981316307197,null,{"$f":"COUNTIF(#REF!,'Series Table'!B135)>0","v":{"$error":"#REF!"}}]
[134,"Nick Davies",{"$f":"IFERROR(VLOOKUP(B136,INDIRECT(\"'\"&$I$1&\"'!\"&\"$C$2:$H$200\"),2,FALSE),\"\")","v":"Rhedwyr Preseli"},{"$f":"IFERROR(VLOOKUP(B136,INDIRECT(\"'\"&$I$1&\"'!\"&\"$C$2:$H$200\"),3,FALSE),\"\")","v":"M"},{"$f":"IFERROR(VLOOKUP(B136,INDIRECT(\"'\"&$I$1&\"'!\"&\"$C$2:$H$200\"),4,FALSE),\"\")","v":"M50"},{"$f":"SUM(LARGE((H136,J136,L136,N136,P136,R136),{1,2,3,4}))","v":102.92445656765597},"",0,0.18618055555555557,102.92445656765597,"",0,"",0,"",0,"",0,1,102.92445656765597,null,{"$f":"COUNTIF(#REF!,'Series Table'!B136)>0","v":{"$error":"#REF!"}}]
[135,"Gareth Morris",{"$f":"IFERROR(VLOOKUP(B137,INDIRECT(\"'\"&$I$1&\"'!\"&\"$C$2:$H$200\"),2,FALSE),\"\")","v":"Buckley Runners"},{"$f":"IFERROR(VLOOKUP(B137,INDIRECT(\"'\"&$I$1&\"'!\"&\"$C$2:$H$200\"),3,FALSE),\"\")","v":"M"},{"$f":"IFERROR(VLOOKUP(B137,INDIRECT(\"'\"&$I$1&\"'!\"&\"$C$2:$H$200\"),4,FALSE),\"\")","v":"M"},{"$f":"SUM(LARGE((H137,J137,L137,N137,P137,R137),{1,2,3,4}))","v":102.8882478606689},"",0,0.18625,102.8882478606689,"",0,"",0,"",0,"",0,1,102.8882478606689,null,{"$f":"COUNTIF(#REF!,'Series Table'!B137)>0","v":{"$error":"#REF!"}}]
[136,"John Rees",{"$f":"IFERROR(VLOOKUP(B138,INDIRECT(\"'\"&$I$1&\"'!\"&\"$C$2:$H$200\"),2,FALSE),\"\")","v":"Rhedwyr Preseli"},{"$f":"IFERROR(VLOOKUP(B138,INDIRECT(\"'\"&$I$1&\"'!\"&\"$C$2:$H$200\"),3,FALSE),\"\")","v":"M"},{"$f":"IFERROR(VLOOKUP(B138,INDIRECT(\"'\"&$I$1&\"'!\"&\"$C$2:$H$200\"),4,FALSE),\"\")","v":"M50"},{"$f":"SUM(LARGE((H138,J138,L138,N138,P138,R138),{1,2,3,4}))","v":102.73737824822275},"",0,0.18653935185185186,102.73737824822275,"",0,"",0,"",0,"",0,1,102.73737824822275,null,{"$f":"COUNTIF(#REF!,'Series Table'!B138)>0","v":{"$error":"#REF!"}}]
[137,"Ben Arkell",{"$f":"IFERROR(VLOOKUP(B139,INDIRECT(\"'\"&$G$1&\"'!\"&\"$C$2:$H$200\"),2,FALSE),\"\")","v":"MDC"},{"$f":"IFERROR(VLOOKUP(B139,INDIRECT(\"'\"&$G$1&\"'!\"&\"$C$2:$H$200\"),3,FALSE),\"\")","v":"M"},{"$f":"IFERROR(VLOOKUP(B139,INDIRECT(\"'\"&$G$1&\"'!\"&\"$C$2:$H$200\"),4,FALSE),\"\")","v":"U23"},{"$f":"SUM(LARGE((H139,J139,L139,N139,P139,R139),{1,2,3,4}))","v":102.45243525258523},"01:26:44",102.45243525258523,"",0,"",0,"",0,"",0,"",0,1,102.45243525258523,null,{"$f":"COUNTIF(#REF!,'Series Table'!B139)>0","v":{"$error":"#REF!"}}]
[138,"Nicky Rees",{"$f":"IFERROR(VLOOKUP(B140,INDIRECT(\"'\"&$I$1&\"'!\"&\"$C$2:$H$200\"),2,FALSE),\"\")","v":"Five Frogs"},{"$f":"IFERROR(VLOOKUP(B140,INDIRECT(\"'\"&$I$1&\"'!\"&\"$C$2:$H$200\"),3,FALSE),\"\")","v":"M"},{"$f":"IFERROR(VLOOKUP(B140,INDIRECT(\"'\"&$I$1&\"'!\"&\"$C$2:$H$200\"),4,FALSE),\"\")","v":"M40"},{"$f":"SUM(LARGE((H140,J140,L140,N140,P140,R140),{1,2,3,4}))","v":102.27873462638651},"",0,0.18741898148148148,102.27873462638651,"",0,"",0,"",0,"",0,1,102.27873462638651,null,{"$f":"COUNTIF(#REF!,'Series Table'!B140)>0","v":{"$error":"#REF!"}}]
[139,"Steve Rogers",{"$f":"IFERROR(VLOOKUP(B141,INDIRECT(\"'\"&$I$1&\"'!\"&\"$C$2:$H$200\"),2,FALSE),\"\")","v":"Five Frogs"},{"$f":"IFERROR(VLOOKUP(B141,INDIRECT(\"'\"&$I$1&\"'!\"&\"$C$2:$H$200\"),3,FALSE),\"\")","v":"M"},{"$f":"IFERROR(VLOOKUP(B141,INDIRECT(\"'\"&$I$1&\"'!\"&\"$C$2:$H$200\"),4,FALSE),\"\")","v":"M40"},{"$f":"SUM(LARGE((H141,J141,L141,N141,P141,R141),{1,2,3,4}))","v":102.27269984188867},"",0,0.18743055555555554,102.27269984188867,"",0,"",0,"",0,"",0,1,102.27269984188867,null,{"$f":"COUNTIF(#REF!,'Series Table'!B141)>0","v":{"$error":"#REF!"}}]
[140,"Gary Pearson",{"$f":"IFERROR(VLOOKUP(B142,INDIRECT(\"'\"&$M$1&\"'!\"&\"$C$2:$H$200\"),2,FALSE),\"\")","v":"Croft Ambrey"},{"$f":"IFERROR(VLOOKUP(B142,INDIRECT(\"'\"&$M$1&\"'!\"&\"$C$2:$H$200\"),3,FALSE),\"\")","v":"M"},{"$f":"IFERROR(VLOOKUP(B142,INDIRECT(\"'\"&$M$1&\"'!\"&\"$C$2:$H$200\"),4,FALSE),\"\")","v":"M40"},{"$f":"SUM(LARGE((H142,J142,L142,N142,P142,R142),{1,2,3,4}))","v":101.8832804116939},"",0,"",0,"",0,3.4571759259259253E-2,101.8832804116939,"",0,"",0,1,101.8832804116939,null,{"$f":"COUNTIF(#REF!,'Series Table'!B142)>0","v":{"$error":"#REF!"}}]
[141,"Dave Clarke",{"$f":"IFERROR(VLOOKUP(B143,INDIRECT(\"'\"&$M$1&\"'!\"&\"$C$2:$H$200\"),2,FALSE),\"\")","v":"Unattached"},{"$f":"IFERROR(VLOOKUP(B143,INDIRECT(\"'\"&$M$1&\"'!\"&\"$C$2:$H$200\"),3,FALSE),\"\")","v":"M"},{"$f":"IFERROR(VLOOKUP(B143,INDIRECT(\"'\"&$M$1&\"'!\"&\"$C$2:$H$200\"),4,FALSE),\"\")","v":"M"},{"$f":"SUM(LARGE((H143,J143,L143,N143,P143,R143),{1,2,3,4}))","v":101.68619292674919},"",0,"",0,"",0,3.4641203703703702E-2,101.68619292674919,"",0,"",0,1,101.68619292674919,null,{"$f":"COUNTIF(#REF!,'Series Table'!B143)>0","v":{"$error":"#REF!"}}]
[142,"Ainslie Corp",{"$f":"IFERROR(VLOOKUP(B144,INDIRECT(\"'\"&$I$1&\"'!\"&\"$C$2:$H$200\"),2,FALSE),\"\")","v":"Penffordd"},{"$f":"IFERROR(VLOOKUP(B144,INDIRECT(\"'\"&$I$1&\"'!\"&\"$C$2:$H$200\"),3,FALSE),\"\")","v":"M"},{"$f":"IFERROR(VLOOKUP(B144,INDIRECT(\"'\"&$I$1&\"'!\"&\"$C$2:$H$200\"),4,FALSE),\"\")","v":"M40"},{"$f":"SUM(LARGE((H144,J144,L144,N144,P144,R144),{1,2,3,4}))","v":101.5243865641558},"",0,0.18886574074074072,101.5243865641558,"",0,"",0,"",0,"",0,1,101.5243865641558,null,{"$f":"COUNTIF(#REF!,'Series Table'!B144)>0","v":{"$error":"#REF!"}}]
[143,"Lawrie Jones",{"$f":"IFERROR(VLOOKUP(B145,INDIRECT(\"'\"&$I$1&\"'!\"&\"$C$2:$H$200\"),2,FALSE),\"\")","v":"Fra"},{"$f":"IFERROR(VLOOKUP(B145,INDIRECT(\"'\"&$I$1&\"'!\"&\"$C$2:$H$200\"),3,FALSE),\"\")","v":"M"},{"$f":"IFERROR(VLOOKUP(B145,INDIRECT(\"'\"&$I$1&\"'!\"&\"$C$2:$H$200\"),4,FALSE),\"\")","v":"M60"},{"$f":"SUM(LARGE((H145,J145,L145,N145,P145,R145),{1,2,3,4}))","v":101.45196915018167},"",0,0.18900462962962963,101.45196915018167,"",0,"",0,"",0,"",0,1,101.45196915018167,null,{"$f":"COUNTIF(#REF!,'Series Table'!B145)>0","v":{"$error":"#REF!"}}]
[144,"Clem Dixon",{"$f":"IFERROR(VLOOKUP(B146,INDIRECT(\"'\"&$M$1&\"'!\"&\"$C$2:$H$200\"),2,FALSE),\"\")","v":"Cambridge Harriers"},{"$f":"IFERROR(VLOOKUP(B146,INDIRECT(\"'\"&$M$1&\"'!\"&\"$C$2:$H$200\"),3,FALSE),\"\")","v":"M"},{"$f":"IFERROR(VLOOKUP(B146,INDIRECT(\"'\"&$M$1&\"'!\"&\"$C$2:$H$200\"),4,FALSE),\"\")","v":"M50"},{"$f":"SUM(LARGE((H146,J146,L146,N146,P146,R146),{1,2,3,4}))","v":101.29201795685975},"",0,"",0,"",0,3.4780092592592592E-2,101.29201795685975,"",0,"",0,1,101.29201795685975,null,{"$f":"COUNTIF(#REF!,'Series Table'!B146)>0","v":{"$error":"#REF!"}}]
[145,"Pauline Linton",{"$f":"IFERROR(VLOOKUP(B147,INDIRECT(\"'\"&$O$1&\"'!\"&\"$C$2:$H$200\"),2,FALSE),\"\")","v":"FRA"},{"$f":"IFERROR(VLOOKUP(B147,INDIRECT(\"'\"&$O$1&\"'!\"&\"$C$2:$H$200\"),3,FALSE),\"\")","v":"F"},{"$f":"IFERROR(VLOOKUP(B147,INDIRECT(\"'\"&$O$1&\"'!\"&\"$C$2:$H$200\"),4,FALSE),\"\")","v":"F50"},{"$f":"SUM(LARGE((H147,J147,L147,N147,P147,R147),{1,2,3,4}))","v":101.23691479724455},"",0,"",0,"",0,"",0,7.1776967592592597E-2,101.23691479724455,"",0,1,101.23691479724455,null,{"$f":"COUNTIF(#REF!,'Series Table'!B147)>0","v":{"$error":"#REF!"}}]
[146,"Chris Chambers",{"$f":"IFERROR(VLOOKUP(B148,INDIRECT(\"'\"&$G$1&\"'!\"&\"$C$2:$H$200\"),2,FALSE),\"\")","v":"Mynydd Du"},{"$f":"IFERROR(VLOOKUP(B148,INDIRECT(\"'\"&$G$1&\"'!\"&\"$C$2:$H$200\"),3,FALSE),\"\")","v":"M"},{"$f":"IFERROR(VLOOKUP(B148,INDIRECT(\"'\"&$G$1&\"'!\"&\"$C$2:$H$200\"),4,FALSE),\"\")","v":"M40"},{"$f":"SUM(LARGE((H148,J148,L148,N148,P148,R148),{1,2,3,4}))","v":101.15904901746384},"01:27:53",101.15904901746384,"",0,"",0,"",0,"",0,"",0,1,101.15904901746384,null,{"$f":"COUNTIF(#REF!,'Series Table'!B148)>0","v":{"$error":"#REF!"}}]
[147,"Dafydd Lewis",{"$f":"IFERROR(VLOOKUP(B149,INDIRECT(\"'\"&$I$1&\"'!\"&\"$C$2:$H$200\"),2,FALSE),\"\")","v":"Whitland"},{"$f":"IFERROR(VLOOKUP(B149,INDIRECT(\"'\"&$I$1&\"'!\"&\"$C$2:$H$200\"),3,FALSE),\"\")","v":"M"},{"$f":"IFERROR(VLOOKUP(B149,INDIRECT(\"'\"&$I$1&\"'!\"&\"$C$2:$H$200\"),4,FALSE),\"\")","v":"M"},{"$f":"SUM(LARGE((H149,J149,L149,N149,P149,R149),{1,2,3,4}))","v":101.07177772681739},"",0,0.1897337962962963,101.07177772681739,"",0,"",0,"",0,"",0,1,101.07177772681739,null,{"$f":"COUNTIF(#REF!,'Series Table'!B149)>0","v":{"$error":"#REF!"}}]
[148,"Max Burns",{"$f":"IFERROR(VLOOKUP(B150,INDIRECT(\"'\"&$G$1&\"'!\"&\"$C$2:$H$200\"),2,FALSE),\"\")","v":"1 Rifles"},{"$f":"IFERROR(VLOOKUP(B150,INDIRECT(\"'\"&$G$1&\"'!\"&\"$C$2:$H$200\"),3,FALSE),\"\")","v":"M"},{"$f":"IFERROR(VLOOKUP(B150,INDIRECT(\"'\"&$G$1&\"'!\"&\"$C$2:$H$200\"),4,FALSE),\"\")","v":"M"},{"$f":"SUM(LARGE((H150,J150,L150,N150,P150,R150),{1,2,3,4}))","v":101.06532537723764},"01:27:58",101.06532537723764,"",0,"",0,"",0,"",0,"",0,1,101.06532537723764,null,{"$f":"COUNTIF(#REF!,'Series Table'!B150)>0","v":{"$error":"#REF!"}}]
[149,"Domi Kimber",{"$f":"IFERROR(VLOOKUP(B151,INDIRECT(\"'\"&$I$1&\"'!\"&\"$C$2:$H$200\"),2,FALSE),\"\")","v":"Rhedwyr Preseli"},{"$f":"IFERROR(VLOOKUP(B151,INDIRECT(\"'\"&$I$1&\"'!\"&\"$C$2:$H$200\"),3,FALSE),\"\")","v":"F"},{"$f":"IFERROR(VLOOKUP(B151,INDIRECT(\"'\"&$I$1&\"'!\"&\"$C$2:$H$200\"),4,FALSE),\"\")","v":"F40"},{"$f":"SUM(LARGE((H151,J151,L151,N151,P151,R151),{1,2,3,4}))","v":101.00539509734108},"",0,0.18986111111111112,101.00539509734108,"",0,"",0,"",0,"",0,1,101.00539509734108,null,{"$f":"COUNTIF(#REF!,'Series Table'!B151)>0","v":{"$error":"#REF!"}}]
[150,"Ben Woods",{"$f":"IFERROR(VLOOKUP(B152,INDIRECT(\"'\"&$I$1&\"'!\"&\"$C$2:$H$200\"),2,FALSE),\"\")","v":"Newcastle Emlyn"},{"$f":"IFERROR(VLOOKUP(B152,INDIRECT(\"'\"&$I$1&\"'!\"&\"$C$2:$H$200\"),3,FALSE),\"\")","v":"M"},{"$f":"IFERROR(VLOOKUP(B152,INDIRECT(\"'\"&$I$1&\"'!\"&\"$C$2:$H$200\"),4,FALSE),\"\")","v":"M"},{"$f":"SUM(LARGE((H152,J152,L152,N152,P152,R152),{1,2,3,4}))","v":100.95711682135833},"",0,0.18995370370370371,100.95711682135833,"",0,"",0,"",0,"",0,1,100.95711682135833,null,{"$f":"COUNTIF(#REF!,'Series Table'!B152)>0","v":{"$error":"#REF!"}}]
[151,"Martin Green",{"$f":"IFERROR(VLOOKUP(B153,INDIRECT(\"'\"&$M$1&\"'!\"&\"$C$2:$H$200\"),2,FALSE),\"\")","v":"Maldwyn Harriers"},{"$f":"IFERROR(VLOOKUP(B153,INDIRECT(\"'\"&$M$1&\"'!\"&\"$C$2:$H$200\"),3,FALSE),\"\")","v":"M"},{"$f":"IFERROR(VLOOKUP(B153,INDIRECT(\"'\"&$M$1&\"'!\"&\"$C$2:$H$200\"),4,FALSE),\"\")","v":"M60"},{"$f":"SUM(LARGE((H153,J153,L153,N153,P153,R153),{1,2,3,4}))","v":100.83214715865543},"",0,"",0,"",0,3.4942129629629635E-2,100.83214715865543,"",0,"",0,1,100.83214715865543,null,{"$f":"COUNTIF(#REF!,'Series Table'!B153)>0","v":{"$error":"#REF!"}}]
[152,"Dafydd James",{"$f":"IFERROR(VLOOKUP(B154,INDIRECT(\"'\"&$I$1&\"'!\"&\"$C$2:$H$200\"),2,FALSE),\"\")","v":"Newcastle Emlyn"},{"$f":"IFERROR(VLOOKUP(B154,INDIRECT(\"'\"&$I$1&\"'!\"&\"$C$2:$H$200\"),3,FALSE),\"\")","v":"M"},{"$f":"IFERROR(VLOOKUP(B154,INDIRECT(\"'\"&$I$1&\"'!\"&\"$C$2:$H$200\"),4,FALSE),\"\")","v":"M"},{"$f":"SUM(LARGE((H154,J154,L154,N154,P154,R154),{1,2,3,4}))","v":100.38984707856082},"",0,0.19104166666666667,100.38984707856082,"",0,"",0,"",0,"",0,1,100.38984707856082,null,{"$f":"COUNTIF(#REF!,'Series Table'!B154)>0","v":{"$error":"#REF!"}}]
[153,"Laura Wainwright",{"$f":"IFERROR(VLOOKUP(B155,INDIRECT(\"'\"&$I$1&\"'!\"&\"$C$2:$H$200\"),2,FALSE),\"\")","v":"Stubbington Green"},{"$f":"IFERROR(VLOOKUP(B155,INDIRECT(\"'\"&$I$1&\"'!\"&\"$C$2:$H$200\"),3,FALSE),\"\")","v":"F"},{"$f":"IFERROR(VLOOKUP(B155,INDIRECT(\"'\"&$I$1&\"'!\"&\"$C$2:$H$200\"),4,FALSE),\"\")","v":"F"},{"$f":"SUM(LARGE((H155,J155,L155,N155,P155,R155),{1,2,3,4}))","v":100.16656005214055},"",0,0.19146990740740741,100.16656005214055,"",0,"",0,"",0,"",0,1,100.16656005214055,null,{"$f":"COUNTIF(#REF!,'Series Table'!B155)>0","v":{"$error":"#REF!"}}]
[154,"Andy James",{"$f":"IFERROR(VLOOKUP(B156,INDIRECT(\"'\"&$I$1&\"'!\"&\"$C$2:$H$200\"),2,FALSE),\"\")","v":"Tailwind Nutrition"},{"$f":"IFERROR(VLOOKUP(B156,INDIRECT(\"'\"&$I$1&\"'!\"&\"$C$2:$H$200\"),3,FALSE),\"\")","v":"M"},{"$f":"IFERROR(VLOOKUP(B156,INDIRECT(\"'\"&$I$1&\"'!\"&\"$C$2:$H$200\"),4,FALSE),\"\")","v":"M40"},{"$f":"SUM(LARGE((H156,J156,L156,N156,P156,R156),{1,2,3,4}))","v":100.1605252676427},"",0,0.19148148148148147,100.1605252676427,"",0,"",0,"",0,"",0,1,100.1605252676427,null,{"$f":"COUNTIF(#REF!,'Series Table'!B156)>0","v":{"$error":"#REF!"}}]
[155,"Richard Smith",{"$f":"IFERROR(VLOOKUP(B157,INDIRECT(\"'\"&$G$1&\"'!\"&\"$C$2:$H$200\"),2,FALSE),\"\")","v":"Dursley"},{"$f":"IFERROR(VLOOKUP(B157,INDIRECT(\"'\"&$G$1&\"'!\"&\"$C$2:$H$200\"),3,FALSE),\"\")","v":"M"},{"$f":"IFERROR(VLOOKUP(B157,INDIRECT(\"'\"&$G$1&\"'!\"&\"$C$2:$H$200\"),4,FALSE),\"\")","v":"M"},{"$f":"SUM(LARGE((H157,J157,L157,N157,P157,R157),{1,2,3,4}))","v":100.12808897497578},"01:28:48",100.12808897497578,"",0,"",0,"",0,"",0,"",0,1,100.12808897497578,null,{"$f":"COUNTIF(#REF!,'Series Table'!B157)>0","v":{"$error":"#REF!"}}]
[156,"Peter Kusy",{"$f":"IFERROR(VLOOKUP(B158,INDIRECT(\"'\"&$I$1&\"'!\"&\"$C$2:$H$200\"),2,FALSE),\"\")","v":"Milford Haven"},{"$f":"IFERROR(VLOOKUP(B158,INDIRECT(\"'\"&$I$1&\"'!\"&\"$C$2:$H$200\"),3,FALSE),\"\")","v":"M"},{"$f":"IFERROR(VLOOKUP(B158,INDIRECT(\"'\"&$I$1&\"'!\"&\"$C$2:$H$200\"),4,FALSE),\"\")","v":"M"},{"$f":"SUM(LARGE((H158,J158,L158,N158,P158,R158),{1,2,3,4}))","v":100.06396871567718},"",0,0.19166666666666665,100.06396871567718,"",0,"",0,"",0,"",0,1,100.06396871567718,null,{"$f":"COUNTIF(#REF!,'Series Table'!B158)>0","v":{"$error":"#REF!"}}]
[157,"Tony Wooldridge",{"$f":"IFERROR(VLOOKUP(B159,INDIRECT(\"'\"&$G$1&\"'!\"&\"$C$2:$H$200\"),2,FALSE),\"\")","v":"Dursley"},{"$f":"IFERROR(VLOOKUP(B159,INDIRECT(\"'\"&$G$1&\"'!\"&\"$C$2:$H$200\"),3,FALSE),\"\")","v":"M"},{"$f":"IFERROR(VLOOKUP(B159,INDIRECT(\"'\"&$G$1&\"'!\"&\"$C$2:$H$200\"),4,FALSE),\"\")","v":"M60"},{"$f":"SUM(LARGE((H159,J159,L159,N159,P159,R159),{1,2,3,4}))","v":99.95938642256867},"01:28:57",99.95938642256867,"",0,"",0,"",0,"",0,"",0,1,99.95938642256867,null,{"$f":"COUNTIF(#REF!,'Series Table'!B159)>0","v":{"$error":"#REF!"}}]
[158,"Jonathan Smith",{"$f":"IFERROR(VLOOKUP(B160,INDIRECT(\"'\"&$M$1&\"'!\"&\"$C$2:$H$200\"),2,FALSE),\"\")","v":"Ranelagh Harriers"},{"$f":"IFERROR(VLOOKUP(B160,INDIRECT(\"'\"&$M$1&\"'!\"&\"$C$2:$H$200\"),3,FALSE),\"\")","v":"M"},{"$f":"IFERROR(VLOOKUP(B160,INDIRECT(\"'\"&$M$1&\"'!\"&\"$C$2:$H$200\"),4,FALSE),\"\")","v":"M"},{"$f":"SUM(LARGE((H160,J160,L160,N160,P160,R160),{1,2,3,4}))","v":99.813861819774473},"",0,"",0,"",0,3.5300925925925923E-2,99.813861819774473,"",0,"",0,1,99.813861819774473,null,{"$f":"COUNTIF(#REF!,'Series Table'!B160)>0","v":{"$error":"#REF!"}}]
[159,"Andrew Noble",{"$f":"IFERROR(VLOOKUP(B161,INDIRECT(\"'\"&$M$1&\"'!\"&\"$C$2:$H$200\"),2,FALSE),\"\")","v":"Folkestone RC"},{"$f":"IFERROR(VLOOKUP(B161,INDIRECT(\"'\"&$M$1&\"'!\"&\"$C$2:$H$200\"),3,FALSE),\"\")","v":"M"},{"$f":"IFERROR(VLOOKUP(B161,INDIRECT(\"'\"&$M$1&\"'!\"&\"$C$2:$H$200\"),4,FALSE),\"\")","v":"M50"},{"$f":"SUM(LARGE((H161,J161,L161,N161,P161,R161),{1,2,3,4}))","v":99.781013905617002},"",0,"",0,"",0,3.5312500000000004E-2,99.781013905617002,"",0,"",0,1,99.781013905617002,null,{"$f":"COUNTIF(#REF!,'Series Table'!B161)>0","v":{"$error":"#REF!"}}]
[160,"Tom Rees",{"$f":"IFERROR(VLOOKUP(B162,INDIRECT(\"'\"&$I$1&\"'!\"&\"$C$2:$H$200\"),2,FALSE),\"\")","v":"Newport,Pembs"},{"$f":"IFERROR(VLOOKUP(B162,INDIRECT(\"'\"&$I$1&\"'!\"&\"$C$2:$H$200\"),3,FALSE),\"\")","v":"M"},{"$f":"IFERROR(VLOOKUP(B162,INDIRECT(\"'\"&$I$1&\"'!\"&\"$C$2:$H$200\"),4,FALSE),\"\")","v":"M"},{"$f":"SUM(LARGE((H162,J162,L162,N162,P162,R162),{1,2,3,4}))","v":99.219098885978781},"",0,0.19328703703703706,99.219098885978781,"",0,"",0,"",0,"",0,1,99.219098885978781,null,{"$f":"COUNTIF(#REF!,'Series Table'!B162)>0","v":{"$error":"#REF!"}}]
[161,"Richard Hudson",{"$f":"IFERROR(VLOOKUP(B163,INDIRECT(\"'\"&$K$1&\"'!\"&\"$C$2:$H$200\"),2,FALSE),\"\")","v":"Avon Valley Runners"},{"$f":"IFERROR(VLOOKUP(B163,INDIRECT(\"'\"&$K$1&\"'!\"&\"$C$2:$H$200\"),3,FALSE),\"\")","v":"M"},{"$f":"IFERROR(VLOOKUP(B163,INDIRECT(\"'\"&$K$1&\"'!\"&\"$C$2:$H$200\"),4,FALSE),\"\")","v":"M50"},{"$f":"SUM(LARGE((H163,J163,L163,N163,P163,R163),{1,2,3,4}))","v":99.204412184221354},"",0,"",0,"01:46:00",99.204412184221354,"",0,"",0,"",0,1,99.204412184221354,null,{"$f":"COUNTIF(#REF!,'Series Table'!B163)>0","v":{"$error":"#REF!"}}]
[162,"Peter Dyer",{"$f":"IFERROR(VLOOKUP(B164,INDIRECT(\"'\"&$K$1&\"'!\"&\"$C$2:$H$200\"),2,FALSE),\"\")","v":"Avon Valley Runners"},{"$f":"IFERROR(VLOOKUP(B164,INDIRECT(\"'\"&$K$1&\"'!\"&\"$C$2:$H$200\"),3,FALSE),\"\")","v":"M"},{"$f":"IFERROR(VLOOKUP(B164,INDIRECT(\"'\"&$K$1&\"'!\"&\"$C$2:$H$200\"),4,FALSE),\"\")","v":"MU23"},{"$f":"SUM(LARGE((H164,J164,L164,N164,P164,R164),{1,2,3,4}))","v":98.982535104123741},"",0,"",0,"01:46:14",98.982535104123741,"",0,"",0,"",0,1,98.982535104123741,null,{"$f":"COUNTIF(#REF!,'Series Table'!B164)>0","v":{"$error":"#REF!"}}]
[163,"Dave Place",{"$f":"IFERROR(VLOOKUP(B165,INDIRECT(\"'\"&$K$1&\"'!\"&\"$C$2:$H$200\"),2,FALSE),\"\")","v":"Unattached"},{"$f":"IFERROR(VLOOKUP(B165,INDIRECT(\"'\"&$K$1&\"'!\"&\"$C$2:$H$200\"),3,FALSE),\"\")","v":"M"},{"$f":"IFERROR(VLOOKUP(B165,INDIRECT(\"'\"&$K$1&\"'!\"&\"$C$2:$H$200\"),4,FALSE),\"\")","v":"M50"},{"$f":"SUM(LARGE((H165,J165,L165,N165,P165,R165),{1,2,3,4}))","v":98.903293289803159},"",0,"",0,"01:46:19",98.903293289803159,"",0,"",0,"",0,1,98.903293289803159,null,{"$f":"COUNTIF(#REF!,'Series Table'!B165)>0","v":{"$error":"#REF!"}}]
[164,"Steve Harrhy",{"$f":"IFERROR(VLOOKUP(B166,INDIRECT(\"'\"&$G$1&\"'!\"&\"$C$2:$H$200\"),2,FALSE),\"\")","v":"Pontypool"},{"$f":"IFERROR(VLOOKUP(B166,INDIRECT(\"'\"&$G$1&\"'!\"&\"$C$2:$H$200\"),3,FALSE),\"\")","v":"M"},{"$f":"IFERROR(VLOOKUP(B166,INDIRECT(\"'\"&$G$1&\"'!\"&\"$C$2:$H$200\"),4,FALSE),\"\")","v":"M50"},{"$f":"SUM(LARGE((H166,J166,L166,N166,P166,R166),{1,2,3,4}))","v":98.872192195944891},"01:29:55",98.872192195944891,"",0,"",0,"",0,"",0,"",0,1,98.872192195944891,null,{"$f":"COUNTIF(#REF!,'Series Table'!B166)>0","v":{"$error":"#REF!"}}]
[165,"Jon Roberts",{"$f":"IFERROR(VLOOKUP(B167,INDIRECT(\"'\"&$O$1&\"'!\"&\"$C$2:$H$200\"),2,FALSE),\"\")","v":"Unattached"},{"$f":"IFERROR(VLOOKUP(B167,INDIRECT(\"'\"&$O$1&\"'!\"&\"$C$2:$H$200\"),3,FALSE),\"\")","v":"M"},{"$f":"IFERROR(VLOOKUP(B167,INDIRECT(\"'\"&$O$1&\"'!\"&\"$C$2:$H$200\"),4,FALSE),\"\")","v":"M"},{"$f":"SUM(LARGE((H167,J167,L167,N167,P167,R167),{1,2,3,4}))","v":98.829123356776719},"",0,"",0,"",0,"",0,7.3526851851851857E-2,98.829123356776719,"",0,1,98.829123356776719,null,{"$f":"COUNTIF(#REF!,'Series Table'!B167)>0","v":{"$error":"#REF!"}}]
[166,"Alice Bedwell",{"$f":"IFERROR(VLOOKUP(B168,INDIRECT(\"'\"&$K$1&\"'!\"&\"$C$2:$H$200\"),2,FALSE),\"\")","v":"MDC"},{"$f":"IFERROR(VLOOKUP(B168,INDIRECT(\"'\"&$K$1&\"'!\"&\"$C$2:$H$200\"),3,FALSE),\"\")","v":"F"},{"$f":"IFERROR(VLOOKUP(B168,INDIRECT(\"'\"&$K$1&\"'!\"&\"$C$2:$H$200\"),4,FALSE),\"\")","v":"F50"},{"$f":"SUM(LARGE((H168,J168,L168,N168,P168,R168),{1,2,3,4}))","v":98.459539129607919},"",0,"",0,"01:46:47",98.459539129607919,"",0,"",0,"",0,1,98.459539129607919,null,{"$f":"COUNTIF(#REF!,'Series Table'!B168)>0","v":{"$error":"#REF!"}}]
[167,"Paul Kelly",{"$f":"IFERROR(VLOOKUP(B169,INDIRECT(\"'\"&$M$1&\"'!\"&\"$C$2:$H$200\"),2,FALSE),\"\")","v":"Durham Fell Runners"},{"$f":"IFERROR(VLOOKUP(B169,INDIRECT(\"'\"&$M$1&\"'!\"&\"$C$2:$H$200\"),3,FALSE),\"\")","v":"M"},{"$f":"IFERROR(VLOOKUP(B169,INDIRECT(\"'\"&$M$1&\"'!\"&\"$C$2:$H$200\"),4,FALSE),\"\")","v":"M60"},{"$f":"SUM(LARGE((H169,J169,L169,N169,P169,R169),{1,2,3,4}))","v":98.105770283587006},"",0,"",0,"",0,3.5902777777777777E-2,98.105770283587006,"",0,"",0,1,98.105770283587006,null,{"$f":"COUNTIF(#REF!,'Series Table'!B169)>0","v":{"$error":"#REF!"}}]
[168,"Peter Sowerby",{"$f":"IFERROR(VLOOKUP(B170,INDIRECT(\"'\"&$K$1&\"'!\"&\"$C$2:$H$200\"),2,FALSE),\"\")","v":"Brecon Ac"},{"$f":"IFERROR(VLOOKUP(B170,INDIRECT(\"'\"&$K$1&\"'!\"&\"$C$2:$H$200\"),3,FALSE),\"\")","v":"M"},{"$f":"IFERROR(VLOOKUP(B170,INDIRECT(\"'\"&$K$1&\"'!\"&\"$C$2:$H$200\"),4,FALSE),\"\")","v":"M50"},{"$f":"SUM(LARGE((H170,J170,L170,N170,P170,R170),{1,2,3,4}))","v":97.825604615043261},"",0,"",0,"01:47:27",97.825604615043261,"",0,"",0,"",0,1,97.825604615043261,null,{"$f":"COUNTIF(#REF!,'Series Table'!B170)>0","v":{"$error":"#REF!"}}]
[169,"Mal Evans",{"$f":"IFERROR(VLOOKUP(B171,INDIRECT(\"'\"&$K$1&\"'!\"&\"$C$2:$H$200\"),2,FALSE),\"\")","v":"Unattached"},{"$f":"IFERROR(VLOOKUP(B171,INDIRECT(\"'\"&$K$1&\"'!\"&\"$C$2:$H$200\"),3,FALSE),\"\")","v":"M"},{"$f":"IFERROR(VLOOKUP(B171,INDIRECT(\"'\"&$K$1&\"'!\"&\"$C$2:$H$200\"),4,FALSE),\"\")","v":"M50"},{"$f":"SUM(LARGE((H171,J171,L171,N171,P171,R171),{1,2,3,4}))","v":97.793907889315008},"",0,"",0,"01:47:29",97.793907889315008,"",0,"",0,"",0,1,97.793907889315008,null,{"$f":"COUNTIF(#REF!,'Series Table'!B171)>0","v":{"$error":"#REF!"}}]
[170,"Timothy Parker",{"$f":"IFERROR(VLOOKUP(B172,INDIRECT(\"'\"&$I$1&\"'!\"&\"$C$2:$H$200\"),2,FALSE),\"\")","v":"Mercia Fell Runners"},{"$f":"IFERROR(VLOOKUP(B172,INDIRECT(\"'\"&$I$1&\"'!\"&\"$C$2:$H$200\"),3,FALSE),\"\")","v":"M"},{"$f":"IFERROR(VLOOKUP(B172,INDIRECT(\"'\"&$I$1&\"'!\"&\"$C$2:$H$200\"),4,FALSE),\"\")","v":"M50"},{"$f":"SUM(LARGE((H172,J172,L172,N172,P172,R172),{1,2,3,4}))","v":97.776785390993709},"",0,0.19605324074074074,97.776785390993709,"",0,"",0,"",0,"",0,1,97.776785390993709,null,{"$f":"COUNTIF(#REF!,'Series Table'!B172)>0","v":{"$error":"#REF!"}}]
[171,"Matt Rogerson",{"$f":"IFERROR(VLOOKUP(B173,INDIRECT(\"'\"&$I$1&\"'!\"&\"$C$2:$H$200\"),2,FALSE),\"\")","v":"Llanelli"},{"$f":"IFERROR(VLOOKUP(B173,INDIRECT(\"'\"&$I$1&\"'!\"&\"$C$2:$H$200\"),3,FALSE),\"\")","v":"M"},{"$f":"IFERROR(VLOOKUP(B173,INDIRECT(\"'\"&$I$1&\"'!\"&\"$C$2:$H$200\"),4,FALSE),\"\")","v":"M40"},{"$f":"SUM(LARGE((H173,J173,L173,N173,P173,R173),{1,2,3,4}))","v":97.197446079200517},"",0,0.19716435185185185,97.197446079200517,"",0,"",0,"",0,"",0,1,97.197446079200517,null,{"$f":"COUNTIF(#REF!,'Series Table'!B173)>0","v":{"$error":"#REF!"}}]
[172,"Jonny Sable",{"$f":"IFERROR(VLOOKUP(B174,INDIRECT(\"'\"&$I$1&\"'!\"&\"$C$2:$H$200\"),2,FALSE),\"\")","v":"Rhedwyr Preseli"},{"$f":"IFERROR(VLOOKUP(B174,INDIRECT(\"'\"&$I$1&\"'!\"&\"$C$2:$H$200\"),3,FALSE),\"\")","v":"M"},{"$f":"IFERROR(VLOOKUP(B174,INDIRECT(\"'\"&$I$1&\"'!\"&\"$C$2:$H$200\"),4,FALSE),\"\")","v":"M"},{"$f":"SUM(LARGE((H174,J174,L174,N174,P174,R174),{1,2,3,4}))","v":96.998298190771621},"",0,0.1975462962962963,96.998298190771621,"",0,"",0,"",0,"",0,1,96.998298190771621,null,{"$f":"COUNTIF(#REF!,'Series Table'!B174)>0","v":{"$error":"#REF!"}}]
[173,"Tim Plumb",{"$f":"IFERROR(VLOOKUP(B175,INDIRECT(\"'\"&$I$1&\"'!\"&\"$C$2:$H$200\"),2,FALSE),\"\")","v":"Narberth"},{"$f":"IFERROR(VLOOKUP(B175,INDIRECT(\"'\"&$I$1&\"'!\"&\"$C$2:$H$200\"),3,FALSE),\"\")","v":"M"},{"$f":"IFERROR(VLOOKUP(B175,INDIRECT(\"'\"&$I$1&\"'!\"&\"$C$2:$H$200\"),4,FALSE),\"\")","v":"M"},{"$f":"SUM(LARGE((H175,J175,L175,N175,P175,R175),{1,2,3,4}))","v":96.907776423303929},"",0,0.19771990740740741,96.907776423303929,"",0,"",0,"",0,"",0,1,96.907776423303929,null,{"$f":"COUNTIF(#REF!,'Series Table'!B175)>0","v":{"$error":"#REF!"}}]
[174,"Michael Brown",{"$f":"IFERROR(VLOOKUP(B176,INDIRECT(\"'\"&$I$1&\"'!\"&\"$C$2:$H$200\"),2,FALSE),\"\")","v":"London"},{"$f":"IFERROR(VLOOKUP(B176,INDIRECT(\"'\"&$I$1&\"'!\"&\"$C$2:$H$200\"),3,FALSE),\"\")","v":"M"},{"$f":"IFERROR(VLOOKUP(B176,INDIRECT(\"'\"&$I$1&\"'!\"&\"$C$2:$H$200\"),4,FALSE),\"\")","v":"M"},{"$f":"SUM(LARGE((H176,J176,L176,N176,P176,R176),{1,2,3,4}))","v":96.901741638806101},"",0,0.19773148148148148,96.901741638806101,"",0,"",0,"",0,"",0,1,96.901741638806101,null,{"$f":"COUNTIF(#REF!,'Series Table'!B176)>0","v":{"$error":"#REF!"}}]
[175,"Simon Blease",{"$f":"IFERROR(VLOOKUP(B177,INDIRECT(\"'\"&$M$1&\"'!\"&\"$C$2:$H$200\"),2,FALSE),\"\")","v":"Brycheiniog"},{"$f":"IFERROR(VLOOKUP(B177,INDIRECT(\"'\"&$M$1&\"'!\"&\"$C$2:$H$200\"),3,FALSE),\"\")","v":"M"},{"$f":"IFERROR(VLOOKUP(B177,INDIRECT(\"'\"&$M$1&\"'!\"&\"$C$2:$H$200\"),4,FALSE),\"\")","v":"M50"},{"$f":"SUM(LARGE((H177,J177,L177,N177,P177,R177),{1,2,3,4}))","v":96.890397459761317},"",0,"",0,"",0,3.6331018518518519E-2,96.890397459761317,"",0,"",0,1,96.890397459761317,null,{"$f":"COUNTIF(#REF!,'Series Table'!B177)>0","v":{"$error":"#REF!"}}]
[176,"Kim Braznell",{"$f":"IFERROR(VLOOKUP(B178,INDIRECT(\"'\"&$I$1&\"'!\"&\"$C$2:$H$200\"),2,FALSE),\"\")","v":"Mercia Fell Runners"},{"$f":"IFERROR(VLOOKUP(B178,INDIRECT(\"'\"&$I$1&\"'!\"&\"$C$2:$H$200\"),3,FALSE),\"\")","v":"F"},{"$f":"IFERROR(VLOOKUP(B178,INDIRECT(\"'\"&$I$1&\"'!\"&\"$C$2:$H$200\"),4,FALSE),\"\")","v":"F60"},{"$f":"SUM(LARGE((H178,J178,L178,N178,P178,R178),{1,2,3,4}))","v":96.841393793827635},"",0,0.1978472222222222,96.841393793827635,"",0,"",0,"",0,"",0,1,96.841393793827635,null,{"$f":"COUNTIF(#REF!,'Series Table'!B178)>0","v":{"$error":"#REF!"}}]
[177,"Claudio Donofrio",{"$f":"IFERROR(VLOOKUP(B179,INDIRECT(\"'\"&$I$1&\"'!\"&\"$C$2:$H$200\"),2,FALSE),\"\")","v":"Swansea"},{"$f":"IFERROR(VLOOKUP(B179,INDIRECT(\"'\"&$I$1&\"'!\"&\"$C$2:$H$200\"),3,FALSE),\"\")","v":"M"},{"$f":"IFERROR(VLOOKUP(B179,INDIRECT(\"'\"&$I$1&\"'!\"&\"$C$2:$H$200\"),4,FALSE),\"\")","v":"M40"},{"$f":"SUM(LARGE((H179,J179,L179,N179,P179,R179),{1,2,3,4}))","v":96.243950128540916},"",0,0.19899305555555555,96.243950128540916,"",0,"",0,"",0,"",0,1,96.243950128540916,null,{"$f":"COUNTIF(#REF!,'Series Table'!B179)>0","v":{"$error":"#REF!"}}]
[178,"Julian Williams",{"$f":"IFERROR(VLOOKUP(B180,INDIRECT(\"'\"&$M$1&\"'!\"&\"$C$2:$H$200\"),2,FALSE),\"\")","v":"London Frontrunners"},{"$f":"IFERROR(VLOOKUP(B180,INDIRECT(\"'\"&$M$1&\"'!\"&\"$C$2:$H$200\"),3,FALSE),\"\")","v":"M"},{"$f":"IFERROR(VLOOKUP(B180,INDIRECT(\"'\"&$M$1&\"'!\"&\"$C$2:$H$200\"),4,FALSE),\"\")","v":"M40"},{"$f":"SUM(LARGE((H180,J180,L180,N180,P180,R180),{1,2,3,4}))","v":96.134895434139935},"",0,"",0,"",0,3.6597222222222225E-2,96.134895434139935,"",0,"",0,1,96.134895434139935,null,{"$f":"COUNTIF(#REF!,'Series Table'!B180)>0","v":{"$error":"#REF!"}}]
[179,"Gareth Oliver",{"$f":"IFERROR(VLOOKUP(B181,INDIRECT(\"'\"&$I$1&\"'!\"&\"$C$2:$H$200\"),2,FALSE),\"\")","v":"Swansea"},{"$f":"IFERROR(VLOOKUP(B181,INDIRECT(\"'\"&$I$1&\"'!\"&\"$C$2:$H$200\"),3,FALSE),\"\")","v":"M"},{"$f":"IFERROR(VLOOKUP(B181,INDIRECT(\"'\"&$I$1&\"'!\"&\"$C$2:$H$200\"),4,FALSE),\"\")","v":"M40"},{"$f":"SUM(LARGE((H181,J181,L181,N181,P181,R181),{1,2,3,4}))","v":95.924106550155088},"",0,0.1996064814814815,95.924106550155088,"",0,"",0,"",0,"",0,1,95.924106550155088,null,{"$f":"COUNTIF(#REF!,'Series Table'!B181)>0","v":{"$error":"#REF!"}}]
[180,"Ricky Holmes",{"$f":"IFERROR(VLOOKUP(B182,INDIRECT(\"'\"&$I$1&\"'!\"&\"$C$2:$H$200\"),2,FALSE),\"\")","v":"Aberporth"},{"$f":"IFERROR(VLOOKUP(B182,INDIRECT(\"'\"&$I$1&\"'!\"&\"$C$2:$H$200\"),3,FALSE),\"\")","v":"M"},{"$f":"IFERROR(VLOOKUP(B182,INDIRECT(\"'\"&$I$1&\"'!\"&\"$C$2:$H$200\"),4,FALSE),\"\")","v":"M"},{"$f":"SUM(LARGE((H182,J182,L182,N182,P182,R182),{1,2,3,4}))","v":95.869793489674478},"",0,0.19971064814814818,95.869793489674478,"",0,"",0,"",0,"",0,1,95.869793489674478,null,{"$f":"COUNTIF(#REF!,'Series Table'!B182)>0","v":{"$error":"#REF!"}}]
[181,"Pauol Sajgalik",{"$f":"IFERROR(VLOOKUP(B183,INDIRECT(\"'\"&$K$1&\"'!\"&\"$C$2:$H$200\"),2,FALSE),\"\")","v":"Tj Drhleny"},{"$f":"IFERROR(VLOOKUP(B183,INDIRECT(\"'\"&$K$1&\"'!\"&\"$C$2:$H$200\"),3,FALSE),\"\")","v":"M"},{"$f":"IFERROR(VLOOKUP(B183,INDIRECT(\"'\"&$K$1&\"'!\"&\"$C$2:$H$200\"),4,FALSE),\"\")","v":"M"},{"$f":"SUM(LARGE((H183,J183,L183,N183,P183,R183),{1,2,3,4}))","v":95.480046911154076},"",0,"",0,"01:49:55",95.480046911154076,"",0,"",0,"",0,1,95.480046911154076,null,{"$f":"COUNTIF(#REF!,'Series Table'!B183)>0","v":{"$error":"#REF!"}}]
[182,"James Morrison",{"$f":"IFERROR(VLOOKUP(B184,INDIRECT(\"'\"&$M$1&\"'!\"&\"$C$2:$H$200\"),2,FALSE),\"\")","v":"Tiverton Harriers"},{"$f":"IFERROR(VLOOKUP(B184,INDIRECT(\"'\"&$M$1&\"'!\"&\"$C$2:$H$200\"),3,FALSE),\"\")","v":"M"},{"$f":"IFERROR(VLOOKUP(B184,INDIRECT(\"'\"&$M$1&\"'!\"&\"$C$2:$H$200\"),4,FALSE),\"\")","v":"M40"},{"$f":"SUM(LARGE((H184,J184,L184,N184,P184,R184),{1,2,3,4}))","v":95.248001751888765},"",0,"",0,"",0,3.6909722222222226E-2,95.248001751888765,"",0,"",0,1,95.248001751888765,null,{"$f":"COUNTIF(#REF!,'Series Table'!B184)>0","v":{"$error":"#REF!"}}]
[183,"Fraser Mcmillan",{"$f":"IFERROR(VLOOKUP(B185,INDIRECT(\"'\"&$I$1&\"'!\"&\"$C$2:$H$200\"),2,FALSE),\"\")","v":"Cardigan Rc"},{"$f":"IFERROR(VLOOKUP(B185,INDIRECT(\"'\"&$I$1&\"'!\"&\"$C$2:$H$200\"),3,FALSE),\"\")","v":"M"},{"$f":"IFERROR(VLOOKUP(B185,INDIRECT(\"'\"&$I$1&\"'!\"&\"$C$2:$H$200\"),4,FALSE),\"\")","v":"M40"},{"$f":"SUM(LARGE((H185,J185,L185,N185,P185,R185),{1,2,3,4}))","v":95.133549780937329},"",0,0.2011226851851852,95.133549780937329,"",0,"",0,"",0,"",0,1,95.133549780937329,null,{"$f":"COUNTIF(#REF!,'Series Table'!B185)>0","v":{"$error":"#REF!"}}]
[184,"Jethro Moore",{"$f":"IFERROR(VLOOKUP(B186,INDIRECT(\"'\"&$I$1&\"'!\"&\"$C$2:$H$200\"),2,FALSE),\"\")","v":"Adventure Beyond"},{"$f":"IFERROR(VLOOKUP(B186,INDIRECT(\"'\"&$I$1&\"'!\"&\"$C$2:$H$200\"),3,FALSE),\"\")","v":"M"},{"$f":"IFERROR(VLOOKUP(B186,INDIRECT(\"'\"&$I$1&\"'!\"&\"$C$2:$H$200\"),4,FALSE),\"\")","v":"M"},{"$f":"SUM(LARGE((H186,J186,L186,N186,P186,R186),{1,2,3,4}))","v":94.85594969403644},"",0,0.20165509259259259,94.85594969403644,"",0,"",0,"",0,"",0,1,94.85594969403644,null,{"$f":"COUNTIF(#REF!,'Series Table'!B186)>0","v":{"$error":"#REF!"}}]
[185,"Theo Akritidis",{"$f":"IFERROR(VLOOKUP(B187,INDIRECT(\"'\"&$I$1&\"'!\"&\"$C$2:$H$200\"),2,FALSE),\"\")","v":"Reading"},{"$f":"IFERROR(VLOOKUP(B187,INDIRECT(\"'\"&$I$1&\"'!\"&\"$C$2:$H$200\"),3,FALSE),\"\")","v":"M"},{"$f":"IFERROR(VLOOKUP(B187,INDIRECT(\"'\"&$I$1&\"'!\"&\"$C$2:$H$200\"),4,FALSE),\"\")","v":"M40"},{"$f":"SUM(LARGE((H187,J187,L187,N187,P187,R187),{1,2,3,4}))","v":94.849914909538583},"",0,0.20166666666666666,94.849914909538583,"",0,"",0,"",0,"",0,1,94.849914909538583,null,{"$f":"COUNTIF(#REF!,'Series Table'!B187)>0","v":{"$error":"#REF!"}}]
[186,"David Place",{"$f":"IFERROR(VLOOKUP(B188,INDIRECT(\"'\"&$M$1&\"'!\"&\"$C$2:$H$200\"),2,FALSE),\"\")","v":"Unattached"},{"$f":"IFERROR(VLOOKUP(B188,INDIRECT(\"'\"&$M$1&\"'!\"&\"$C$2:$H$200\"),3,FALSE),\"\")","v":"M"},{"$f":"IFERROR(VLOOKUP(B188,INDIRECT(\"'\"&$M$1&\"'!\"&\"$C$2:$H$200\"),4,FALSE),\"\")","v":"M50"},{"$f":"SUM(LARGE((H188,J188,L188,N188,P188,R188),{1,2,3,4}))","v":94.492499726267411},"",0,"",0,"",0,3.7175925925925925E-2,94.492499726267411,"",0,"",0,1,94.492499726267411,null,{"$f":"COUNTIF(#REF!,'Series Table'!B188)>0","v":{"$error":"#REF!"}}]
[187,"Andrew Blackmore",{"$f":"IFERROR(VLOOKUP(B189,INDIRECT(\"'\"&$O$1&\"'!\"&\"$C$2:$H$200\"),2,FALSE),\"\")","v":"MDC"},{"$f":"IFERROR(VLOOKUP(B189,INDIRECT(\"'\"&$O$1&\"'!\"&\"$C$2:$H$200\"),3,FALSE),\"\")","v":"M"},{"$f":"IFERROR(VLOOKUP(B189,INDIRECT(\"'\"&$O$1&\"'!\"&\"$C$2:$H$200\"),4,FALSE),\"\")","v":"M50"},{"$f":"SUM(LARGE((H189,J189,L189,N189,P189,R189),{1,2,3,4}))","v":94.440824319665026},"",0,"",0,"",0,"",0,7.6716087962962962E-2,94.440824319665026,"",0,1,94.440824319665026,null,{"$f":"COUNTIF(#REF!,'Series Table'!B189)>0","v":{"$error":"#REF!"}}]
[188,"Martin Scrivens",{"$f":"IFERROR(VLOOKUP(B190,INDIRECT(\"'\"&$O$1&\"'!\"&\"$C$2:$H$200\"),2,FALSE),\"\")","v":"Unattached"},{"$f":"IFERROR(VLOOKUP(B190,INDIRECT(\"'\"&$O$1&\"'!\"&\"$C$2:$H$200\"),3,FALSE),\"\")","v":"M"},{"$f":"IFERROR(VLOOKUP(B190,INDIRECT(\"'\"&$O$1&\"'!\"&\"$C$2:$H$200\"),4,FALSE),\"\")","v":"M"},{"$f":"SUM(LARGE((H190,J190,L190,N190,P190,R190),{1,2,3,4}))","v":94.004781395926628},"",0,"",0,"",0,"",0,7.7032986111111104E-2,94.004781395926628,"",0,1,94.004781395926628,null,{"$f":"COUNTIF(#REF!,'Series Table'!B190)>0","v":{"$error":"#REF!"}}]
[189,"Sue Howard",{"$f":"IFERROR(VLOOKUP(B191,INDIRECT(\"'\"&$I$1&\"'!\"&\"$C$2:$H$200\"),2,FALSE),\"\")","v":"Mercis Fell Runners"},{"$f":"IFERROR(VLOOKUP(B191,INDIRECT(\"'\"&$I$1&\"'!\"&\"$C$2:$H$200\"),3,FALSE),\"\")","v":"F"},{"$f":"IFERROR(VLOOKUP(B191,INDIRECT(\"'\"&$I$1&\"'!\"&\"$C$2:$H$200\"),4,FALSE),\"\")","v":"F50"},{"$f":"SUM(LARGE((H191,J191,L191,N191,P191,R191),{1,2,3,4}))","v":93.769688484424236},"",0,0.20373842592592592,93.769688484424236,"",0,"",0,"",0,"",0,1,93.769688484424236,null,{"$f":"COUNTIF(#REF!,'Series Table'!B191)>0","v":{"$error":"#REF!"}}]
[190,"Tim Edwards",{"$f":"IFERROR(VLOOKUP(B192,INDIRECT(\"'\"&$K$1&\"'!\"&\"$C$2:$H$200\"),2,FALSE),\"\")","v":"Unattached"},{"$f":"IFERROR(VLOOKUP(B192,INDIRECT(\"'\"&$K$1&\"'!\"&\"$C$2:$H$200\"),3,FALSE),\"\")","v":"M"},{"$f":"IFERROR(VLOOKUP(B192,INDIRECT(\"'\"&$K$1&\"'!\"&\"$C$2:$H$200\"),4,FALSE),\"\")","v":"M"},{"$f":"SUM(LARGE((H192,J192,L192,N192,P192,R192),{1,2,3,4}))","v":93.451456464547221},"",0,"",0,"01:52:03",93.451456464547221,"",0,"",0,"",0,1,93.451456464547221,null,{"$f":"COUNTIF(#REF!,'Series Table'!B192)>0","v":{"$error":"#REF!"}}]
[191,"Trys Johns",{"$f":"IFERROR(VLOOKUP(B193,INDIRECT(\"'\"&$I$1&\"'!\"&\"$C$2:$H$200\"),2,FALSE),\"\")","v":"Cardigan Rc"},{"$f":"IFERROR(VLOOKUP(B193,INDIRECT(\"'\"&$I$1&\"'!\"&\"$C$2:$H$200\"),3,FALSE),\"\")","v":"M"},{"$f":"IFERROR(VLOOKUP(B193,INDIRECT(\"'\"&$I$1&\"'!\"&\"$C$2:$H$200\"),4,FALSE),\"\")","v":"M"},{"$f":"SUM(LARGE((H193,J193,L193,N193,P193,R193),{1,2,3,4}))","v":93.407601414553483},"",0,0.20443287037037039,93.407601414553483,"",0,"",0,"",0,"",0,1,93.407601414553483,null,{"$f":"COUNTIF(#REF!,'Series Table'!B193)>0","v":{"$error":"#REF!"}}]
[192,"Ged Murphy",{"$f":"IFERROR(VLOOKUP(B194,INDIRECT(\"'\"&$M$1&\"'!\"&\"$C$2:$H$200\"),2,FALSE),\"\")","v":"Unattached"},{"$f":"IFERROR(VLOOKUP(B194,INDIRECT(\"'\"&$M$1&\"'!\"&\"$C$2:$H$200\"),3,FALSE),\"\")","v":"M"},{"$f":"IFERROR(VLOOKUP(B194,INDIRECT(\"'\"&$M$1&\"'!\"&\"$C$2:$H$200\"),4,FALSE),\"\")","v":"M40"},{"$f":"SUM(LARGE((H194,J194,L194,N194,P194,R194),{1,2,3,4}))","v":93.342822730756609},"",0,"",0,"",0,3.7581018518518521E-2,93.342822730756609,"",0,"",0,1,93.342822730756609,null,{"$f":"COUNTIF(#REF!,'Series Table'!B194)>0","v":{"$error":"#REF!"}}]
[193,"Helen Duffield",{"$f":"IFERROR(VLOOKUP(B195,INDIRECT(\"'\"&$I$1&\"'!\"&\"$C$2:$H$200\"),2,FALSE),\"\")","v":"Sedbury"},{"$f":"IFERROR(VLOOKUP(B195,INDIRECT(\"'\"&$I$1&\"'!\"&\"$C$2:$H$200\"),3,FALSE),\"\")","v":"F"},{"$f":"IFERROR(VLOOKUP(B195,INDIRECT(\"'\"&$I$1&\"'!\"&\"$C$2:$H$200\"),4,FALSE),\"\")","v":"F40"},{"$f":"SUM(LARGE((H195,J195,L195,N195,P195,R195),{1,2,3,4}))","v":93.063618698176299},{"$f":"IFERROR(VLOOKUP(B195,INDIRECT(\"'\"&$G$1&\"'!\"&\"$C$2:$H$200\"),5,FALSE),\"\")","v":""},{"$f":"IFERROR(VLOOKUP(B195,INDIRECT(\"'\"&$G$1&\"'!\"&\"$C$2:$H$200\"),6,FALSE),0)","v":0},{"$f":"IFERROR(VLOOKUP(B195,INDIRECT(\"'\"&$I$1&\"'!\"&\"$C$2:$G$200\"),5,FALSE),\"\")","v":0.2050925925925926},{"$f":"IFERROR(VLOOKUP(B195,INDIRECT(\"'\"&$I$1&\"'!\"&\"$C$2:$H$200\"),6,FALSE),0)","v":93.063618698176299},{"$f":"IFERROR(VLOOKUP(B195,INDIRECT(\"'\"&$K$1&\"'!\"&\"$C$2:$H$200\"),5,FALSE),\"\")","v":""},{"$f":"IFERROR(VLOOKUP(B195,INDIRECT(\"'\"&$K$1&\"'!\"&\"$C$2:$H$200\"),6,FALSE),0)","v":0},{"$f":"IFERROR(VLOOKUP(B195,INDIRECT(\"'\"&$M$1&\"'!\"&\"$C$2:$h$200\"),5,FALSE),\"\")","v":""},{"$f":"IFERROR(VLOOKUP(B195,INDIRECT(\"'\"&$M$1&\"'!\"&\"$C$2:$h$200\"),6,FALSE),0)","v":0},{"$f":"IFERROR(VLOOKUP(B195,INDIRECT(\"'\"&$O$1&\"'!\"&\"$C$2:$h$200\"),5,FALSE),\"\")","v":""},{"$f":"IFERROR(VLOOKUP(B195,INDIRECT(\"'\"&$O$1&\"'!\"&\"$C$2:$h$200\"),6,FALSE),0)","v":0},{"$f":"IFERROR(VLOOKUP(B195,INDIRECT(\"'\"&$Q$1&\"'!\"&\"$C$2:$h$200\"),5,FALSE),\"\")","v":""},{"$f":"IFERROR(VLOOKUP(B195,INDIRECT(\"'\"&$Q$1&\"'!\"&\"$C$2:$h$200\"),6,FALSE),0)","v":0},{"$f":"6-COUNTIF(G195:Q195,\"\")","v":1},{"$f":"F195/IF(S195>4,4,S195)","v":93.063618698176299},null,{"$f":"COUNTIF(#REF!,'Series Table'!B195)>0","v":{"$error":"#REF!"}}]
[{"$f":"ROW(A194)","v":194},"David Sheard",{"$f":"IFERROR(VLOOKUP(B196,INDIRECT(\"'\"&$I$1&\"'!\"&\"$C$2:$H$200\"),2,FALSE),\"\")","v":"Bridgend"},{"$f":"IFERROR(VLOOKUP(B196,INDIRECT(\"'\"&$I$1&\"'!\"&\"$C$2:$H$200\"),3,FALSE),\"\")","v":"M"},{"$f":"IFERROR(VLOOKUP(B196,INDIRECT(\"'\"&$I$1&\"'!\"&\"$C$2:$H$200\"),4,FALSE),\"\")","v":"M50"},{"$f":"SUM(LARGE((H196,J196,L196,N196,P196,R196),{1,2,3,4}))","v":92.876540378743087},"",0,0.20545138888888889,92.876540378743087,"",0,"",0,"",0,"",0,1,92.876540378743087,null,{"$f":"COUNTIF(#REF!,'Series Table'!B196)>0","v":{"$error":"#REF!"}}]
[195,"Trevor McAlister",{"$f":"IFERROR(VLOOKUP(B197,INDIRECT(\"'\"&$M$1&\"'!\"&\"$C$2:$H$200\"),2,FALSE),\"\")","v":"Ryde Harriers"},{"$f":"IFERROR(VLOOKUP(B197,INDIRECT(\"'\"&$M$1&\"'!\"&\"$C$2:$H$200\"),3,FALSE),\"\")","v":"M"},{"$f":"IFERROR(VLOOKUP(B197,INDIRECT(\"'\"&$M$1&\"'!\"&\"$C$2:$H$200\"),4,FALSE),\"\")","v":"M"},{"$f":"SUM(LARGE((H197,J197,L197,N197,P197,R197),{1,2,3,4}))","v":92.784408190079944},"",0,"",0,"",0,3.7777777777777778E-2,92.784408190079944,"",0,"",0,1,92.784408190079944,null,{"$f":"COUNTIF(#REF!,'Series Table'!B197)>0","v":{"$error":"#REF!"}}]
[196,"Robert Gale",{"$f":"IFERROR(VLOOKUP(B198,INDIRECT(\"'\"&$I$1&\"'!\"&\"$C$2:$H$200\"),2,FALSE),\"\")","v":"Newport Gwent"},{"$f":"IFERROR(VLOOKUP(B198,INDIRECT(\"'\"&$I$1&\"'!\"&\"$C$2:$H$200\"),3,FALSE),\"\")","v":"M"},{"$f":"IFERROR(VLOOKUP(B198,INDIRECT(\"'\"&$I$1&\"'!\"&\"$C$2:$H$200\"),4,FALSE),\"\")","v":"M"},{"$f":"SUM(LARGE((H198,J198,L198,N198,P198,R198),{1,2,3,4}))","v":92.653253352322821},"",0,0.20587962962962961,92.653253352322821,"",0,"",0,"",0,"",0,1,92.653253352322821,null,{"$f":"COUNTIF(#REF!,'Series Table'!B198)>0","v":{"$error":"#REF!"}}]
[197,"George Colville",{"$f":"IFERROR(VLOOKUP(B199,INDIRECT(\"'\"&$I$1&\"'!\"&\"$C$2:$H$200\"),2,FALSE),\"\")","v":"Blaggers Tri"},{"$f":"IFERROR(VLOOKUP(B199,INDIRECT(\"'\"&$I$1&\"'!\"&\"$C$2:$H$200\"),3,FALSE),\"\")","v":"M"},{"$f":"IFERROR(VLOOKUP(B199,INDIRECT(\"'\"&$I$1&\"'!\"&\"$C$2:$H$200\"),4,FALSE),\"\")","v":"M"},{"$f":"SUM(LARGE((H199,J199,L199,N199,P199,R199),{1,2,3,4}))","v":92.230818437473602},"",0,0.20668981481481483,92.230818437473602,"",0,"",0,"",0,"",0,1,92.230818437473602,null,{"$f":"COUNTIF(#REF!,'Series Table'!B199)>0","v":{"$error":"#REF!"}}]
[198,"Simeon Jenkins",{"$f":"IFERROR(VLOOKUP(B200,INDIRECT(\"'\"&$I$1&\"'!\"&\"$C$2:$H$200\"),2,FALSE),\"\")","v":"Blaggers Tri"},{"$f":"IFERROR(VLOOKUP(B200,INDIRECT(\"'\"&$I$1&\"'!\"&\"$C$2:$H$200\"),3,FALSE),\"\")","v":"M"},{"$f":"IFERROR(VLOOKUP(B200,INDIRECT(\"'\"&$I$1&\"'!\"&\"$C$2:$H$200\"),4,FALSE),\"\")","v":"M40"},{"$f":"SUM(LARGE((H200,J200,L200,N200,P200,R200),{1,2,3,4}))","v":92.224783652975745},"",0,0.20670138888888889,92.224783652975745,"",0,"",0,"",0,"",0,1,92.224783652975745,null,{"$f":"COUNTIF(#REF!,'Series Table'!B200)>0","v":{"$error":"#REF!"}}]
[199,"Richard Quinn",{"$f":"IFERROR(VLOOKUP(B201,INDIRECT(\"'\"&$M$1&\"'!\"&\"$C$2:$H$200\"),2,FALSE),\"\")","v":"Unattached"},{"$f":"IFERROR(VLOOKUP(B201,INDIRECT(\"'\"&$M$1&\"'!\"&\"$C$2:$H$200\"),3,FALSE),\"\")","v":"M"},{"$f":"IFERROR(VLOOKUP(B201,INDIRECT(\"'\"&$M$1&\"'!\"&\"$C$2:$H$200\"),4,FALSE),\"\")","v":"M"},{"$f":"SUM(LARGE((H201,J201,L201,N201,P201,R201),{1,2,3,4}))","v":91.930362421986217},"",0,"",0,"",0,3.8078703703703705E-2,91.930362421986217,"",0,"",0,1,91.930362421986217,null,{"$f":"COUNTIF(#REF!,'Series Table'!B201)>0","v":{"$error":"#REF!"}}]
[200,"Naomi Law",{"$f":"IFERROR(VLOOKUP(B202,INDIRECT(\"'\"&$K$1&\"'!\"&\"$C$2:$H$200\"),2,FALSE),\"\")","v":"Mynydd Du"},{"$f":"IFERROR(VLOOKUP(B202,INDIRECT(\"'\"&$K$1&\"'!\"&\"$C$2:$H$200\"),3,FALSE),\"\")","v":"F"},{"$f":"IFERROR(VLOOKUP(B202,INDIRECT(\"'\"&$K$1&\"'!\"&\"$C$2:$H$200\"),4,FALSE),\"\")","v":"F40"},{"$f":"SUM(LARGE((H202,J202,L202,N202,P202,R202),{1,2,3,4}))","v":91.803226726679128},"",0,"",0,"01:53:47",91.803226726679128,"",0,"",0,"",0,1,91.803226726679128,null,{"$f":"COUNTIF(#REF!,'Series Table'!B202)>0","v":{"$error":"#REF!"}}]
[201,"Alan Stanley",{"$f":"IFERROR(VLOOKUP(B203,INDIRECT(\"'\"&$M$1&\"'!\"&\"$C$2:$H$200\"),2,FALSE),\"\")","v":"Unattached"},{"$f":"IFERROR(VLOOKUP(B203,INDIRECT(\"'\"&$M$1&\"'!\"&\"$C$2:$H$200\"),3,FALSE),\"\")","v":"M"},{"$f":"IFERROR(VLOOKUP(B203,INDIRECT(\"'\"&$M$1&\"'!\"&\"$C$2:$H$200\"),4,FALSE),\"\")","v":"M50"},{"$f":"SUM(LARGE((H203,J203,L203,N203,P203,R203),{1,2,3,4}))","v":91.569035366254241},"",0,"",0,"",0,3.8206018518518521E-2,91.569035366254241,"",0,"",0,1,91.569035366254241,null,{"$f":"COUNTIF(#REF!,'Series Table'!B203)>0","v":{"$error":"#REF!"}}]
[202,"Steven Badger",{"$f":"IFERROR(VLOOKUP(B204,INDIRECT(\"'\"&$I$1&\"'!\"&\"$C$2:$H$200\"),2,FALSE),\"\")","v":"Swansea Choc Tea Pot!"},{"$f":"IFERROR(VLOOKUP(B204,INDIRECT(\"'\"&$I$1&\"'!\"&\"$C$2:$H$200\"),3,FALSE),\"\")","v":"M"},{"$f":"IFERROR(VLOOKUP(B204,INDIRECT(\"'\"&$I$1&\"'!\"&\"$C$2:$H$200\"),4,FALSE),\"\")","v":"M40"},{"$f":"SUM(LARGE((H204,J204,L204,N204,P204,R204),{1,2,3,4}))","v":91.379913823277391},"",0,0.20832175925925925,91.379913823277391,"",0,"",0,"",0,"",0,1,91.379913823277391,null,{"$f":"COUNTIF(#REF!,'Series Table'!B204)>0","v":{"$error":"#REF!"}}]
[203,"Gary Lewis","Presteigne Pacers","M","M40",{"$f":"SUM(LARGE((H205,J205,L205,N205,P205,R205),{1,2,3,4}))","v":91.223009426333391},"",0,0.2086226851851852,91.223009426333391,"",0,"",0,"",0,"",0,1,91.223009426333391,null,{"$f":"COUNTIF(#REF!,'Series Table'!B205)>0","v":{"$error":"#REF!"}}]
[204,"Rita Tomkins","Presteigne Pacers","F","F50",{"$f":"SUM(LARGE((H206,J206,L206,N206,P206,R206),{1,2,3,4}))","v":91.216974641835534},"",0,0.20863425925925927,91.216974641835534,"",0,"",0,"",0,"",0,1,91.216974641835534,null,{"$f":"COUNTIF(#REF!,'Series Table'!B206)>0","v":{"$error":"#REF!"}}]
[205,"David Mackie","Corsham,Wilts","M","M40",{"$f":"SUM(LARGE((H207,J207,L207,N207,P207,R207),{1,2,3,4}))","v":91.126452874367843},"",0,0.20880787037037038,91.126452874367843,"",0,"",0,"",0,"",0,1,91.126452874367843,null,{"$f":"COUNTIF(#REF!,'Series Table'!B207)>0","v":{"$error":"#REF!"}}]
[206,"Luisa Fogarty","Northumberland","F","F",{"$f":"SUM(LARGE((H208,J208,L208,N208,P208,R208),{1,2,3,4}))","v":91.078174598385104},"",0,0.20890046296296297,91.078174598385104,"",0,"",0,"",0,"",0,1,91.078174598385104,null,{"$f":"COUNTIF(#REF!,'Series Table'!B208)>0","v":{"$error":"#REF!"}}]
[207,"Justin Pocknell","Ddmt/Caerleon Rc","M","M40",{"$f":"SUM(LARGE((H209,J209,L209,N209,P209,R209),{1,2,3,4}))","v":90.685913606025139},"",0,0.20965277777777777,90.685913606025139,"",0,"",0,"",0,"",0,1,90.685913606025139,null,{"$f":"COUNTIF(#REF!,'Series Table'!B209)>0","v":{"$error":"#REF!"}}]
[208,"Natalie Taylor",{"$f":"IFERROR(VLOOKUP(B210,INDIRECT(\"'\"&$M$1&\"'!\"&\"$C$2:$H$200\"),2,FALSE),\"\")","v":"Mynydd Du"},{"$f":"IFERROR(VLOOKUP(B210,INDIRECT(\"'\"&$M$1&\"'!\"&\"$C$2:$H$200\"),3,FALSE),\"\")","v":"F"},{"$f":"IFERROR(VLOOKUP(B210,INDIRECT(\"'\"&$M$1&\"'!\"&\"$C$2:$H$200\"),4,FALSE),\"\")","v":"F"},{"$f":"SUM(LARGE((H210,J210,L210,N210,P210,R210),{1,2,3,4}))","v":90.485054199058339},"",0,"",0,"",0,3.858796296296297E-2,90.485054199058339,"",0,"",0,1,90.485054199058339,null,{"$f":"COUNTIF(#REF!,'Series Table'!B210)>0","v":{"$error":"#REF!"}}]
[209,"Alwyn Oliver",{"$f":"IFERROR(VLOOKUP(B211,INDIRECT(\"'\"&$I$1&\"'!\"&\"$C$2:$H$200\"),2,FALSE),\"\")","v":"Eryri Harriers"},{"$f":"IFERROR(VLOOKUP(B211,INDIRECT(\"'\"&$I$1&\"'!\"&\"$C$2:$H$200\"),3,FALSE),\"\")","v":"M"},{"$f":"IFERROR(VLOOKUP(B211,INDIRECT(\"'\"&$I$1&\"'!\"&\"$C$2:$H$200\"),4,FALSE),\"\")","v":"M70"},{"$f":"SUM(LARGE((H211,J211,L211,N211,P211,R211),{1,2,3,4}))","v":90.263478691175948},"",0,0.21046296296296296,90.263478691175948,"",0,"",0,"",0,"",0,1,90.263478691175948,null,{"$f":"COUNTIF(#REF!,'Series Table'!B211)>0","v":{"$error":"#REF!"}}]
[210,"Chris Hall",{"$f":"IFERROR(VLOOKUP(B212,INDIRECT(\"'\"&$M$1&\"'!\"&\"$C$2:$H$200\"),2,FALSE),\"\")","v":"Stubbington Green Runners"},{"$f":"IFERROR(VLOOKUP(B212,INDIRECT(\"'\"&$M$1&\"'!\"&\"$C$2:$H$200\"),3,FALSE),\"\")","v":"M"},{"$f":"IFERROR(VLOOKUP(B212,INDIRECT(\"'\"&$M$1&\"'!\"&\"$C$2:$H$200\"),4,FALSE),\"\")","v":"M50"},{"$f":"SUM(LARGE((H212,J212,L212,N212,P212,R212),{1,2,3,4}))","v":90.12372714332642},"",0,"",0,"",0,3.8715277777777779E-2,90.12372714332642,"",0,"",0,1,90.12372714332642,null,{"$f":"COUNTIF(#REF!,'Series Table'!B212)>0","v":{"$error":"#REF!"}}]
[211,"Rob Bruford",{"$f":"IFERROR(VLOOKUP(B213,INDIRECT(\"'\"&$I$1&\"'!\"&\"$C$2:$H$200\"),2,FALSE),\"\")","v":"Warrington"},{"$f":"IFERROR(VLOOKUP(B213,INDIRECT(\"'\"&$I$1&\"'!\"&\"$C$2:$H$200\"),3,FALSE),\"\")","v":"M"},{"$f":"IFERROR(VLOOKUP(B213,INDIRECT(\"'\"&$I$1&\"'!\"&\"$C$2:$H$200\"),4,FALSE),\"\")","v":"M"},{"$f":"SUM(LARGE((H213,J213,L213,N213,P213,R213),{1,2,3,4}))","v":90.040191664755653},"",0,0.21089120370370371,90.040191664755653,"",0,"",0,"",0,"",0,1,90.040191664755653,null,{"$f":"COUNTIF(#REF!,'Series Table'!B213)>0","v":{"$error":"#REF!"}}]
[212,"Laurie Hughes",{"$f":"IFERROR(VLOOKUP(B214,INDIRECT(\"'\"&$I$1&\"'!\"&\"$C$2:$H$200\"),2,FALSE),\"\")","v":"Swansea"},{"$f":"IFERROR(VLOOKUP(B214,INDIRECT(\"'\"&$I$1&\"'!\"&\"$C$2:$H$200\"),3,FALSE),\"\")","v":"M"},{"$f":"IFERROR(VLOOKUP(B214,INDIRECT(\"'\"&$I$1&\"'!\"&\"$C$2:$H$200\"),4,FALSE),\"\")","v":"M50"},{"$f":"SUM(LARGE((H214,J214,L214,N214,P214,R214),{1,2,3,4}))","v":89.732417655365524},"",0,0.21148148148148149,89.732417655365524,"",0,"",0,"",0,"",0,1,89.732417655365524,null,{"$f":"COUNTIF(#REF!,'Series Table'!B214)>0","v":{"$error":"#REF!"}}]
[213,"Marcelle Mackay",{"$f":"IFERROR(VLOOKUP(B215,INDIRECT(\"'\"&$I$1&\"'!\"&\"$C$2:$H$200\"),2,FALSE),\"\")","v":"Hirwaun"},{"$f":"IFERROR(VLOOKUP(B215,INDIRECT(\"'\"&$I$1&\"'!\"&\"$C$2:$H$200\"),3,FALSE),\"\")","v":"F"},{"$f":"IFERROR(VLOOKUP(B215,INDIRECT(\"'\"&$I$1&\"'!\"&\"$C$2:$H$200\"),4,FALSE),\"\")","v":"F40"},{"$f":"SUM(LARGE((H215,J215,L215,N215,P215,R215),{1,2,3,4}))","v":89.660000241391373},"",0,0.21162037037037038,89.660000241391373,"",0,"",0,"",0,"",0,1,89.660000241391373,null,{"$f":"COUNTIF(#REF!,'Series Table'!B215)>0","v":{"$error":"#REF!"}}]
[214,"John Morris",{"$f":"IFERROR(VLOOKUP(B216,INDIRECT(\"'\"&$M$1&\"'!\"&\"$C$2:$H$200\"),2,FALSE),\"\")","v":"Buckley Runners"},{"$f":"IFERROR(VLOOKUP(B216,INDIRECT(\"'\"&$M$1&\"'!\"&\"$C$2:$H$200\"),3,FALSE),\"\")","v":"M"},{"$f":"IFERROR(VLOOKUP(B216,INDIRECT(\"'\"&$M$1&\"'!\"&\"$C$2:$H$200\"),4,FALSE),\"\")","v":"M70"},{"$f":"SUM(LARGE((H216,J216,L216,N216,P216,R216),{1,2,3,4}))","v":89.138289718602891},"",0,"",0,"",0,3.90625E-2,89.138289718602891,"",0,"",0,1,89.138289718602891,null,{"$f":"COUNTIF(#REF!,'Series Table'!B216)>0","v":{"$error":"#REF!"}}]
[215,"Mark Scrivens",{"$f":"IFERROR(VLOOKUP(B217,INDIRECT(\"'\"&$O$1&\"'!\"&\"$C$2:$H$200\"),2,FALSE),\"\")","v":"Monross Trailblazers"},{"$f":"IFERROR(VLOOKUP(B217,INDIRECT(\"'\"&$O$1&\"'!\"&\"$C$2:$H$200\"),3,FALSE),\"\")","v":"M"},{"$f":"IFERROR(VLOOKUP(B217,INDIRECT(\"'\"&$O$1&\"'!\"&\"$C$2:$H$200\"),4,FALSE),\"\")","v":"M40"},{"$f":"SUM(LARGE((H217,J217,L217,N217,P217,R217),{1,2,3,4}))","v":88.975954733075},"",0,"",0,"",0,"",0,8.0687731481481492E-2,88.975954733075,"",0,1,88.975954733075,null,{"$f":"COUNTIF(#REF!,'Series Table'!B217)>0","v":{"$error":"#REF!"}}]
[216,"Gareth Davies",{"$f":"IFERROR(VLOOKUP(B218,INDIRECT(\"'\"&$I$1&\"'!\"&\"$C$2:$H$200\"),2,FALSE),\"\")","v":"Broughton"},{"$f":"IFERROR(VLOOKUP(B218,INDIRECT(\"'\"&$I$1&\"'!\"&\"$C$2:$H$200\"),3,FALSE),\"\")","v":"M"},{"$f":"IFERROR(VLOOKUP(B218,INDIRECT(\"'\"&$I$1&\"'!\"&\"$C$2:$H$200\"),4,FALSE),\"\")","v":"M40"},{"$f":"SUM(LARGE((H218,J218,L218,N218,P218,R218),{1,2,3,4}))","v":88.8694434721736},"",0,0.21313657407407408,88.8694434721736,"",0,"",0,"",0,"",0,1,88.8694434721736,null,{"$f":"COUNTIF(#REF!,'Series Table'!B218)>0","v":{"$error":"#REF!"}}]
[217,"James Relph",{"$f":"IFERROR(VLOOKUP(B219,INDIRECT(\"'\"&$M$1&\"'!\"&\"$C$2:$H$200\"),2,FALSE),\"\")","v":"London Frontrunners"},{"$f":"IFERROR(VLOOKUP(B219,INDIRECT(\"'\"&$M$1&\"'!\"&\"$C$2:$H$200\"),3,FALSE),\"\")","v":"M"},{"$f":"IFERROR(VLOOKUP(B219,INDIRECT(\"'\"&$M$1&\"'!\"&\"$C$2:$H$200\"),4,FALSE),\"\")","v":"M"},{"$f":"SUM(LARGE((H219,J219,L219,N219,P219,R219),{1,2,3,4}))","v":88.382787692981509},"",0,"",0,"",0,3.9328703703703706E-2,88.382787692981509,"",0,"",0,1,88.382787692981509,null,{"$f":"COUNTIF(#REF!,'Series Table'!B219)>0","v":{"$error":"#REF!"}}]
[218,"Sarah Pemberton",{"$f":"IFERROR(VLOOKUP(B220,INDIRECT(\"'\"&$M$1&\"'!\"&\"$C$2:$H$200\"),2,FALSE),\"\")","v":"Serpentine Running Club"},{"$f":"IFERROR(VLOOKUP(B220,INDIRECT(\"'\"&$M$1&\"'!\"&\"$C$2:$H$200\"),3,FALSE),\"\")","v":"F"},{"$f":"IFERROR(VLOOKUP(B220,INDIRECT(\"'\"&$M$1&\"'!\"&\"$C$2:$H$200\"),4,FALSE),\"\")","v":"F"},{"$f":"SUM(LARGE((H220,J220,L220,N220,P220,R220),{1,2,3,4}))","v":88.185700208036792},"",0,"",0,"",0,3.9398148148148147E-2,88.185700208036792,"",0,"",0,1,88.185700208036792,null,{"$f":"COUNTIF(#REF!,'Series Table'!B220)>0","v":{"$error":"#REF!"}}]
[219,"Sophie Smith",{"$f":"IFERROR(VLOOKUP(B221,INDIRECT(\"'\"&$M$1&\"'!\"&\"$C$2:$H$200\"),2,FALSE),\"\")","v":"Bournville Harriers"},{"$f":"IFERROR(VLOOKUP(B221,INDIRECT(\"'\"&$M$1&\"'!\"&\"$C$2:$H$200\"),3,FALSE),\"\")","v":"F"},{"$f":"IFERROR(VLOOKUP(B221,INDIRECT(\"'\"&$M$1&\"'!\"&\"$C$2:$H$200\"),4,FALSE),\"\")","v":"F"},{"$f":"SUM(LARGE((H221,J221,L221,N221,P221,R221),{1,2,3,4}))","v":88.120004379721919},"",0,"",0,"",0,3.9421296296296295E-2,88.120004379721919,"",0,"",0,1,88.120004379721919,null,{"$f":"COUNTIF(#REF!,'Series Table'!B221)>0","v":{"$error":"#REF!"}}]
[220,"Dan Eade",{"$f":"IFERROR(VLOOKUP(B222,INDIRECT(\"'\"&$I$1&\"'!\"&\"$C$2:$H$200\"),2,FALSE),\"\")","v":"Leukaemia Care"},{"$f":"IFERROR(VLOOKUP(B222,INDIRECT(\"'\"&$I$1&\"'!\"&\"$C$2:$H$200\"),3,FALSE),\"\")","v":"M"},{"$f":"IFERROR(VLOOKUP(B222,INDIRECT(\"'\"&$I$1&\"'!\"&\"$C$2:$H$200\"),4,FALSE),\"\")","v":"M"},{"$f":"SUM(LARGE((H222,J222,L222,N222,P222,R222),{1,2,3,4}))","v":88.11509540994291},"",0,0.21458333333333335,88.11509540994291,"",0,"",0,"",0,"",0,1,88.11509540994291,null,{"$f":"COUNTIF(#REF!,'Series Table'!B222)>0","v":{"$error":"#REF!"}}]
[221,"Hugh Morgan-Jones",{"$f":"IFERROR(VLOOKUP(B223,INDIRECT(\"'\"&$K$1&\"'!\"&\"$C$2:$H$200\"),2,FALSE),\"\")","v":"FRA"},{"$f":"IFERROR(VLOOKUP(B223,INDIRECT(\"'\"&$K$1&\"'!\"&\"$C$2:$H$200\"),3,FALSE),\"\")","v":"M"},{"$f":"IFERROR(VLOOKUP(B223,INDIRECT(\"'\"&$K$1&\"'!\"&\"$C$2:$H$200\"),4,FALSE),\"\")","v":"M50"},{"$f":"SUM(LARGE((H223,J223,L223,N223,P223,R223),{1,2,3,4}))","v":87.95207455069891},"",0,"",0,"01:57:50",87.95207455069891,"",0,"",0,"",0,1,87.95207455069891,null,{"$f":"COUNTIF(#REF!,'Series Table'!B223)>0","v":{"$error":"#REF!"}}]
[222,"Tim Buckley",{"$f":"IFERROR(VLOOKUP(B224,INDIRECT(\"'\"&$G$1&\"'!\"&\"$C$2:$H$200\"),2,FALSE),\"\")","v":"Chepstow"},{"$f":"IFERROR(VLOOKUP(B224,INDIRECT(\"'\"&$G$1&\"'!\"&\"$C$2:$H$200\"),3,FALSE),\"\")","v":"M"},{"$f":"IFERROR(VLOOKUP(B224,INDIRECT(\"'\"&$G$1&\"'!\"&\"$C$2:$H$200\"),4,FALSE),\"\")","v":"M50"},{"$f":"SUM(LARGE((H224,J224,L224,N224,P224,R224),{1,2,3,4}))","v":87.906526289481107},"01:39:40",87.906526289481107,"",0,"",0,"",0,"",0,"",0,1,87.906526289481107,null,{"$f":"COUNTIF(#REF!,'Series Table'!B224)>0","v":{"$error":"#REF!"}}]
[223,"Tim Watkins",{"$f":"IFERROR(VLOOKUP(B225,INDIRECT(\"'\"&$O$1&\"'!\"&\"$C$2:$H$200\"),2,FALSE),\"\")","v":"Forest Of Dean Ac"},{"$f":"IFERROR(VLOOKUP(B225,INDIRECT(\"'\"&$O$1&\"'!\"&\"$C$2:$H$200\"),3,FALSE),\"\")","v":"M"},{"$f":"IFERROR(VLOOKUP(B225,INDIRECT(\"'\"&$O$1&\"'!\"&\"$C$2:$H$200\"),4,FALSE),\"\")","v":"M"},{"$f":"SUM(LARGE((H225,J225,L225,N225,P225,R225),{1,2,3,4}))","v":87.527680683229491},"",0,"",0,"",0,"",0,8.1740277777777773E-2,87.527680683229491,"",0,1,87.527680683229491,null,{"$f":"COUNTIF(#REF!,'Series Table'!B225)>0","v":{"$error":"#REF!"}}]
[224,"Fiona Cooper",{"$f":"IFERROR(VLOOKUP(B226,INDIRECT(\"'\"&$I$1&\"'!\"&\"$C$2:$H$200\"),2,FALSE),\"\")","v":"Newport,Pembs"},{"$f":"IFERROR(VLOOKUP(B226,INDIRECT(\"'\"&$I$1&\"'!\"&\"$C$2:$H$200\"),3,FALSE),\"\")","v":"F"},{"$f":"IFERROR(VLOOKUP(B226,INDIRECT(\"'\"&$I$1&\"'!\"&\"$C$2:$H$200\"),4,FALSE),\"\")","v":"F"},{"$f":"SUM(LARGE((H226,J226,L226,N226,P226,R226),{1,2,3,4}))","v":87.445234330682055},"",0,0.21586805555555555,87.445234330682055,"",0,"",0,"",0,"",0,1,87.445234330682055,null,{"$f":"COUNTIF(#REF!,'Series Table'!B226)>0","v":{"$error":"#REF!"}}]
[225,"Ian Morgan",{"$f":"IFERROR(VLOOKUP(B227,INDIRECT(\"'\"&$M$1&\"'!\"&\"$C$2:$H$200\"),2,FALSE),\"\")","v":"Forest of Dean AC"},{"$f":"IFERROR(VLOOKUP(B227,INDIRECT(\"'\"&$M$1&\"'!\"&\"$C$2:$H$200\"),3,FALSE),\"\")","v":"M"},{"$f":"IFERROR(VLOOKUP(B227,INDIRECT(\"'\"&$M$1&\"'!\"&\"$C$2:$H$200\"),4,FALSE),\"\")","v":"M"},{"$f":"SUM(LARGE((H227,J227,L227,N227,P227,R227),{1,2,3,4}))","v":87.134566954998377},"",0,"",0,"",0,3.9768518518518516E-2,87.134566954998377,"",0,"",0,1,87.134566954998377,null,{"$f":"COUNTIF(#REF!,'Series Table'!B227)>0","v":{"$error":"#REF!"}}]
[226,"Graham Maynard",{"$f":"IFERROR(VLOOKUP(B228,INDIRECT(\"'\"&$M$1&\"'!\"&\"$C$2:$H$200\"),2,FALSE),\"\")","v":"Cambridge Harriers"},{"$f":"IFERROR(VLOOKUP(B228,INDIRECT(\"'\"&$M$1&\"'!\"&\"$C$2:$H$200\"),3,FALSE),\"\")","v":"M"},{"$f":"IFERROR(VLOOKUP(B228,INDIRECT(\"'\"&$M$1&\"'!\"&\"$C$2:$H$200\"),4,FALSE),\"\")","v":"M50"},{"$f":"SUM(LARGE((H228,J228,L228,N228,P228,R228),{1,2,3,4}))","v":86.707544070951514},"",0,"",0,"",0,3.9918981481481479E-2,86.707544070951514,"",0,"",0,1,86.707544070951514,null,{"$f":"COUNTIF(#REF!,'Series Table'!B228)>0","v":{"$error":"#REF!"}}]
[227,"Giulia Basevi",{"$f":"IFERROR(VLOOKUP(B229,INDIRECT(\"'\"&$I$1&\"'!\"&\"$C$2:$H$200\"),2,FALSE),\"\")","v":"Rhedwyr Preseli"},{"$f":"IFERROR(VLOOKUP(B229,INDIRECT(\"'\"&$I$1&\"'!\"&\"$C$2:$H$200\"),3,FALSE),\"\")","v":"F"},{"$f":"IFERROR(VLOOKUP(B229,INDIRECT(\"'\"&$I$1&\"'!\"&\"$C$2:$H$200\"),4,FALSE),\"\")","v":"F"},{"$f":"SUM(LARGE((H229,J229,L229,N229,P229,R229),{1,2,3,4}))","v":86.419320966048303},"",0,0.21783564814814815,86.419320966048303,"",0,"",0,"",0,"",0,1,86.419320966048303,null,{"$f":"COUNTIF(#REF!,'Series Table'!B229)>0","v":{"$error":"#REF!"}}]
[228,"Neil Grant",{"$f":"IFERROR(VLOOKUP(B230,INDIRECT(\"'\"&$G$1&\"'!\"&\"$C$2:$H$200\"),2,FALSE),\"\")","v":"Chepstow"},{"$f":"IFERROR(VLOOKUP(B230,INDIRECT(\"'\"&$G$1&\"'!\"&\"$C$2:$H$200\"),3,FALSE),\"\")","v":"M"},{"$f":"IFERROR(VLOOKUP(B230,INDIRECT(\"'\"&$G$1&\"'!\"&\"$C$2:$H$200\"),4,FALSE),\"\")","v":"M60"},{"$f":"SUM(LARGE((H230,J230,L230,N230,P230,R230),{1,2,3,4}))","v":86.294479677590701},"01:41:06",86.294479677590701,"",0,"",0,"",0,"",0,"",0,1,86.294479677590701,null,{"$f":"COUNTIF(#REF!,'Series Table'!B230)>0","v":{"$error":"#REF!"}}]
[229,"Matthew Mason",{"$f":"IFERROR(VLOOKUP(B231,INDIRECT(\"'\"&$M$1&\"'!\"&\"$C$2:$H$200\"),2,FALSE),\"\")","v":"Ely Runners"},{"$f":"IFERROR(VLOOKUP(B231,INDIRECT(\"'\"&$M$1&\"'!\"&\"$C$2:$H$200\"),3,FALSE),\"\")","v":"M"},{"$f":"IFERROR(VLOOKUP(B231,INDIRECT(\"'\"&$M$1&\"'!\"&\"$C$2:$H$200\"),4,FALSE),\"\")","v":"M40"},{"$f":"SUM(LARGE((H231,J231,L231,N231,P231,R231),{1,2,3,4}))","v":85.327931676338579},"",0,"",0,"",0,4.040509259259259E-2,85.327931676338579,"",0,"",0,1,85.327931676338579,null,{"$f":"COUNTIF(#REF!,'Series Table'!B231)>0","v":{"$error":"#REF!"}}]
[230,"Wyn Davies",{"$f":"IFERROR(VLOOKUP(B232,INDIRECT(\"'\"&$G$1&\"'!\"&\"$C$2:$H$200\"),2,FALSE),\"\")","v":"Mynydd Du"},{"$f":"IFERROR(VLOOKUP(B232,INDIRECT(\"'\"&$G$1&\"'!\"&\"$C$2:$H$200\"),3,FALSE),\"\")","v":"M"},{"$f":"IFERROR(VLOOKUP(B232,INDIRECT(\"'\"&$G$1&\"'!\"&\"$C$2:$H$200\"),4,FALSE),\"\")","v":"M50"},{"$f":"SUM(LARGE((H232,J232,L232,N232,P232,R232),{1,2,3,4}))","v":84.663688337655074},"01:42:33",84.663688337655074,"",0,"",0,"",0,"",0,"",0,1,84.663688337655074,null,{"$f":"COUNTIF(#REF!,'Series Table'!B232)>0","v":{"$error":"#REF!"}}]
[231,"Nick Ashley",{"$f":"IFERROR(VLOOKUP(B233,INDIRECT(\"'\"&$M$1&\"'!\"&\"$C$2:$H$200\"),2,FALSE),\"\")","v":"Unattached"},{"$f":"IFERROR(VLOOKUP(B233,INDIRECT(\"'\"&$M$1&\"'!\"&\"$C$2:$H$200\"),3,FALSE),\"\")","v":"M"},{"$f":"IFERROR(VLOOKUP(B233,INDIRECT(\"'\"&$M$1&\"'!\"&\"$C$2:$H$200\"),4,FALSE),\"\")","v":"M50"},{"$f":"SUM(LARGE((H233,J233,L233,N233,P233,R233),{1,2,3,4}))","v":83.948319281725631},"",0,"",0,"",0,4.08912037037037E-2,83.948319281725631,"",0,"",0,1,83.948319281725631,null,{"$f":"COUNTIF(#REF!,'Series Table'!B233)>0","v":{"$error":"#REF!"}}]
[232,"Ian Marshall",{"$f":"IFERROR(VLOOKUP(B234,INDIRECT(\"'\"&$M$1&\"'!\"&\"$C$2:$H$200\"),2,FALSE),\"\")","v":"Cambridge Harriers"},{"$f":"IFERROR(VLOOKUP(B234,INDIRECT(\"'\"&$M$1&\"'!\"&\"$C$2:$H$200\"),3,FALSE),\"\")","v":"M"},{"$f":"IFERROR(VLOOKUP(B234,INDIRECT(\"'\"&$M$1&\"'!\"&\"$C$2:$H$200\"),4,FALSE),\"\")","v":"M60"},{"$f":"SUM(LARGE((H234,J234,L234,N234,P234,R234),{1,2,3,4}))","v":83.88262345341073},"",0,"",0,"",0,4.0914351851851848E-2,83.88262345341073,"",0,"",0,1,83.88262345341073,null,{"$f":"COUNTIF(#REF!,'Series Table'!B234)>0","v":{"$error":"#REF!"}}]
[233,"Jane Ward",{"$f":"IFERROR(VLOOKUP(B235,INDIRECT(\"'\"&$I$1&\"'!\"&\"$C$2:$H$200\"),2,FALSE),\"\")","v":"Dorset Doddlers"},{"$f":"IFERROR(VLOOKUP(B235,INDIRECT(\"'\"&$I$1&\"'!\"&\"$C$2:$H$200\"),3,FALSE),\"\")","v":"F"},{"$f":"IFERROR(VLOOKUP(B235,INDIRECT(\"'\"&$I$1&\"'!\"&\"$C$2:$H$200\"),4,FALSE),\"\")","v":"F40"},{"$f":"SUM(LARGE((H235,J235,L235,N235,P235,R235),{1,2,3,4}))","v":83.860572338961788},"",0,0.22274305555555554,83.860572338961788,"",0,"",0,"",0,"",0,1,83.860572338961788,null,{"$f":"COUNTIF(#REF!,'Series Table'!B235)>0","v":{"$error":"#REF!"}}]
[234,"Alex Harries",{"$f":"IFERROR(VLOOKUP(B236,INDIRECT(\"'\"&$I$1&\"'!\"&\"$C$2:$H$200\"),2,FALSE),\"\")","v":"Cardiff"},{"$f":"IFERROR(VLOOKUP(B236,INDIRECT(\"'\"&$I$1&\"'!\"&\"$C$2:$H$200\"),3,FALSE),\"\")","v":"M"},{"$f":"IFERROR(VLOOKUP(B236,INDIRECT(\"'\"&$I$1&\"'!\"&\"$C$2:$H$200\"),4,FALSE),\"\")","v":"M"},{"$f":"SUM(LARGE((H236,J236,L236,N236,P236,R236),{1,2,3,4}))","v":83.842467985468261},"",0,0.22277777777777777,83.842467985468261,"",0,"",0,"",0,"",0,1,83.842467985468261,null,{"$f":"COUNTIF(#REF!,'Series Table'!B236)>0","v":{"$error":"#REF!"}}]
[235,"Carl Platel",{"$f":"IFERROR(VLOOKUP(B237,INDIRECT(\"'\"&$I$1&\"'!\"&\"$C$2:$H$200\"),2,FALSE),\"\")","v":"Fit For Life"},{"$f":"IFERROR(VLOOKUP(B237,INDIRECT(\"'\"&$I$1&\"'!\"&\"$C$2:$H$200\"),3,FALSE),\"\")","v":"M"},{"$f":"IFERROR(VLOOKUP(B237,INDIRECT(\"'\"&$I$1&\"'!\"&\"$C$2:$H$200\"),4,FALSE),\"\")","v":"M50"},{"$f":"SUM(LARGE((H237,J237,L237,N237,P237,R237),{1,2,3,4}))","v":83.715737511013486},"",0,0.22302083333333333,83.715737511013486,"",0,"",0,"",0,"",0,1,83.715737511013486,null,{"$f":"COUNTIF(#REF!,'Series Table'!B237)>0","v":{"$error":"#REF!"}}]
[236,"Geraint Jones",{"$f":"IFERROR(VLOOKUP(B238,INDIRECT(\"'\"&$I$1&\"'!\"&\"$C$2:$H$200\"),2,FALSE),\"\")","v":"Trefin"},{"$f":"IFERROR(VLOOKUP(B238,INDIRECT(\"'\"&$I$1&\"'!\"&\"$C$2:$H$200\"),3,FALSE),\"\")","v":"M"},{"$f":"IFERROR(VLOOKUP(B238,INDIRECT(\"'\"&$I$1&\"'!\"&\"$C$2:$H$200\"),4,FALSE),\"\")","v":"M40"},{"$f":"SUM(LARGE((H238,J238,L238,N238,P238,R238),{1,2,3,4}))","v":83.480380915597507},"",0,0.22347222222222221,83.480380915597507,"",0,"",0,"",0,"",0,1,83.480380915597507,null,{"$f":"COUNTIF(#REF!,'Series Table'!B238)>0","v":{"$error":"#REF!"}}]
[237,"Stuart Duncan",{"$f":"IFERROR(VLOOKUP(B239,INDIRECT(\"'\"&$G$1&\"'!\"&\"$C$2:$H$200\"),2,FALSE),\"\")","v":"Chepstow"},{"$f":"IFERROR(VLOOKUP(B239,INDIRECT(\"'\"&$G$1&\"'!\"&\"$C$2:$H$200\"),3,FALSE),\"\")","v":"M"},{"$f":"IFERROR(VLOOKUP(B239,INDIRECT(\"'\"&$G$1&\"'!\"&\"$C$2:$H$200\"),4,FALSE),\"\")","v":"M50"},{"$f":"SUM(LARGE((H239,J239,L239,N239,P239,R239),{1,2,3,4}))","v":83.276578462307498},"01:43:47",83.276578462307498,"",0,"",0,"",0,"",0,"",0,1,83.276578462307498,null,{"$f":"COUNTIF(#REF!,'Series Table'!B239)>0","v":{"$error":"#REF!"}}]
[238,"Peter McDonald",{"$f":"IFERROR(VLOOKUP(B240,INDIRECT(\"'\"&$M$1&\"'!\"&\"$C$2:$H$200\"),2,FALSE),\"\")","v":"Unattached"},{"$f":"IFERROR(VLOOKUP(B240,INDIRECT(\"'\"&$M$1&\"'!\"&\"$C$2:$H$200\"),3,FALSE),\"\")","v":"M"},{"$f":"IFERROR(VLOOKUP(B240,INDIRECT(\"'\"&$M$1&\"'!\"&\"$C$2:$H$200\"),4,FALSE),\"\")","v":"M"},{"$f":"SUM(LARGE((H240,J240,L240,N240,P240,R240),{1,2,3,4}))","v":83.094273513631876},"",0,"",0,"",0,4.1192129629629634E-2,83.094273513631876,"",0,"",0,1,83.094273513631876,null,{"$f":"COUNTIF(#REF!,'Series Table'!B240)>0","v":{"$error":"#REF!"}}]
[239,"Lee Skone",{"$f":"IFERROR(VLOOKUP(B241,INDIRECT(\"'\"&$I$1&\"'!\"&\"$C$2:$H$200\"),2,FALSE),\"\")","v":"Crap Tri"},{"$f":"IFERROR(VLOOKUP(B241,INDIRECT(\"'\"&$I$1&\"'!\"&\"$C$2:$H$200\"),3,FALSE),\"\")","v":"M"},{"$f":"IFERROR(VLOOKUP(B241,INDIRECT(\"'\"&$I$1&\"'!\"&\"$C$2:$H$200\"),4,FALSE),\"\")","v":"M40"},{"$f":"SUM(LARGE((H241,J241,L241,N241,P241,R241),{1,2,3,4}))","v":82.925180741795714},"",0,0.22453703703703706,82.925180741795714,"",0,"",0,"",0,"",0,1,82.925180741795714,null,{"$f":"COUNTIF(#REF!,'Series Table'!B241)>0","v":{"$error":"#REF!"}}]
[240,"Celia Mills",{"$f":"IFERROR(VLOOKUP(B242,INDIRECT(\"'\"&$K$1&\"'!\"&\"$C$2:$H$200\"),2,FALSE),\"\")","v":"Unattached"},{"$f":"IFERROR(VLOOKUP(B242,INDIRECT(\"'\"&$K$1&\"'!\"&\"$C$2:$H$200\"),3,FALSE),\"\")","v":"F"},{"$f":"IFERROR(VLOOKUP(B242,INDIRECT(\"'\"&$K$1&\"'!\"&\"$C$2:$H$200\"),4,FALSE),\"\")","v":"F50"},{"$f":"SUM(LARGE((H242,J242,L242,N242,P242,R242),{1,2,3,4}))","v":82.420995911122375},"",0,"",0,"02:03:39",82.420995911122375,"",0,"",0,"",0,1,82.420995911122375,null,{"$f":"COUNTIF(#REF!,'Series Table'!B242)>0","v":{"$error":"#REF!"}}]
[241,"Dan Jones",{"$f":"IFERROR(VLOOKUP(B243,INDIRECT(\"'\"&$I$1&\"'!\"&\"$C$2:$H$200\"),2,FALSE),\"\")","v":"Solva"},{"$f":"IFERROR(VLOOKUP(B243,INDIRECT(\"'\"&$I$1&\"'!\"&\"$C$2:$H$200\"),3,FALSE),\"\")","v":"M"},{"$f":"IFERROR(VLOOKUP(B243,INDIRECT(\"'\"&$I$1&\"'!\"&\"$C$2:$H$200\"),4,FALSE),\"\")","v":"M40"},{"$f":"SUM(LARGE((H243,J243,L243,N243,P243,R243),{1,2,3,4}))","v":82.182902248560708},"",0,0.22596064814814817,82.182902248560708,"",0,"",0,"",0,"",0,1,82.182902248560708,null,{"$f":"COUNTIF(#REF!,'Series Table'!B243)>0","v":{"$error":"#REF!"}}]
[242,"Neil Williams",{"$f":"IFERROR(VLOOKUP(B244,INDIRECT(\"'\"&$M$1&\"'!\"&\"$C$2:$H$200\"),2,FALSE),\"\")","v":"Mynydd Du"},{"$f":"IFERROR(VLOOKUP(B244,INDIRECT(\"'\"&$M$1&\"'!\"&\"$C$2:$H$200\"),3,FALSE),\"\")","v":"M"},{"$f":"IFERROR(VLOOKUP(B244,INDIRECT(\"'\"&$M$1&\"'!\"&\"$C$2:$H$200\"),4,FALSE),\"\")","v":"M"},{"$f":"SUM(LARGE((H244,J244,L244,N244,P244,R244),{1,2,3,4}))","v":81.714661119018956},"",0,"",0,"",0,4.1678240740740745E-2,81.714661119018956,"",0,"",0,1,81.714661119018956,null,{"$f":"COUNTIF(#REF!,'Series Table'!B244)>0","v":{"$error":"#REF!"}}]
[243,"Daniel Seymour",{"$f":"IFERROR(VLOOKUP(B245,INDIRECT(\"'\"&$M$1&\"'!\"&\"$C$2:$H$200\"),2,FALSE),\"\")","v":"Unattached"},{"$f":"IFERROR(VLOOKUP(B245,INDIRECT(\"'\"&$M$1&\"'!\"&\"$C$2:$H$200\"),3,FALSE),\"\")","v":"M"},{"$f":"IFERROR(VLOOKUP(B245,INDIRECT(\"'\"&$M$1&\"'!\"&\"$C$2:$H$200\"),4,FALSE),\"\")","v":"M"},{"$f":"SUM(LARGE((H245,J245,L245,N245,P245,R245),{1,2,3,4}))","v":81.32048614912955},"",0,"",0,"",0,4.1817129629629628E-2,81.32048614912955,"",0,"",0,1,81.32048614912955,null,{"$f":"COUNTIF(#REF!,'Series Table'!B245)>0","v":{"$error":"#REF!"}}]
[244,"Sue Lloyd",{"$f":"IFERROR(VLOOKUP(B246,INDIRECT(\"'\"&$I$1&\"'!\"&\"$C$2:$H$200\"),2,FALSE),\"\")","v":"Pembrokeshire Harriers"},{"$f":"IFERROR(VLOOKUP(B246,INDIRECT(\"'\"&$I$1&\"'!\"&\"$C$2:$H$200\"),3,FALSE),\"\")","v":"F"},{"$f":"IFERROR(VLOOKUP(B246,INDIRECT(\"'\"&$I$1&\"'!\"&\"$C$2:$H$200\"),4,FALSE),\"\")","v":"F50"},{"$f":"SUM(LARGE((H246,J246,L246,N246,P246,R246),{1,2,3,4}))","v":81.241475866896806},"",0,0.22776620370370371,81.241475866896806,"",0,"",0,"",0,"",0,1,81.241475866896806,null,{"$f":"COUNTIF(#REF!,'Series Table'!B246)>0","v":{"$error":"#REF!"}}]
[245,"Nathanial Swan",{"$f":"IFERROR(VLOOKUP(B247,INDIRECT(\"'\"&$O$1&\"'!\"&\"$C$2:$H$200\"),2,FALSE),\"\")","v":"Unattached"},{"$f":"IFERROR(VLOOKUP(B247,INDIRECT(\"'\"&$O$1&\"'!\"&\"$C$2:$H$200\"),3,FALSE),\"\")","v":"M"},{"$f":"IFERROR(VLOOKUP(B247,INDIRECT(\"'\"&$O$1&\"'!\"&\"$C$2:$H$200\"),4,FALSE),\"\")","v":"M"},{"$f":"SUM(LARGE((H247,J247,L247,N247,P247,R247),{1,2,3,4}))","v":80.198401122860957},"",0,"",0,"",0,"",0,8.706689814814815E-2,80.198401122860957,"",0,1,80.198401122860957,null,{"$f":"COUNTIF(#REF!,'Series Table'!B247)>0","v":{"$error":"#REF!"}}]
[246,"Sj Restall",{"$f":"IFERROR(VLOOKUP(B248,INDIRECT(\"'\"&$I$1&\"'!\"&\"$C$2:$H$200\"),2,FALSE),\"\")","v":"Ddmt"},{"$f":"IFERROR(VLOOKUP(B248,INDIRECT(\"'\"&$I$1&\"'!\"&\"$C$2:$H$200\"),3,FALSE),\"\")","v":"F"},{"$f":"IFERROR(VLOOKUP(B248,INDIRECT(\"'\"&$I$1&\"'!\"&\"$C$2:$H$200\"),4,FALSE),\"\")","v":"F40"},{"$f":"SUM(LARGE((H248,J248,L248,N248,P248,R248),{1,2,3,4}))","v":80.179353795275986},"",0,0.22980324074074074,80.179353795275986,"",0,"",0,"",0,"",0,1,80.179353795275986,null,{"$f":"COUNTIF(#REF!,'Series Table'!B248)>0","v":{"$error":"#REF!"}}]
[247,"Marc Recopuille",{"$f":"IFERROR(VLOOKUP(B249,INDIRECT(\"'\"&$K$1&\"'!\"&\"$C$2:$H$200\"),2,FALSE),\"\")","v":"Unattached"},{"$f":"IFERROR(VLOOKUP(B249,INDIRECT(\"'\"&$K$1&\"'!\"&\"$C$2:$H$200\"),3,FALSE),\"\")","v":"M"},{"$f":"IFERROR(VLOOKUP(B249,INDIRECT(\"'\"&$K$1&\"'!\"&\"$C$2:$H$200\"),4,FALSE),\"\")","v":"M40"},{"$f":"SUM(LARGE((H249,J249,L249,N249,P249,R249),{1,2,3,4}))","v":80.107134932961415},"",0,"",0,"02:06:05",80.107134932961415,"",0,"",0,"",0,1,80.107134932961415,null,{"$f":"COUNTIF(#REF!,'Series Table'!B249)>0","v":{"$error":"#REF!"}}]
[248,"John Kerley",{"$f":"IFERROR(VLOOKUP(B250,INDIRECT(\"'\"&$K$1&\"'!\"&\"$C$2:$H$200\"),2,FALSE),\"\")","v":"As Chamonix"},{"$f":"IFERROR(VLOOKUP(B250,INDIRECT(\"'\"&$K$1&\"'!\"&\"$C$2:$H$200\"),3,FALSE),\"\")","v":"M"},{"$f":"IFERROR(VLOOKUP(B250,INDIRECT(\"'\"&$K$1&\"'!\"&\"$C$2:$H$200\"),4,FALSE),\"\")","v":"M60"},{"$f":"SUM(LARGE((H250,J250,L250,N250,P250,R250),{1,2,3,4}))","v":80.075438207233191},"",0,"",0,"02:06:07",80.075438207233191,"",0,"",0,"",0,1,80.075438207233191,null,{"$f":"COUNTIF(#REF!,'Series Table'!B250)>0","v":{"$error":"#REF!"}}]
[249,"Marc Beasley",{"$f":"IFERROR(VLOOKUP(B251,INDIRECT(\"'\"&$I$1&\"'!\"&\"$C$2:$H$200\"),2,FALSE),\"\")","v":"Rhedwyr Preseli"},{"$f":"IFERROR(VLOOKUP(B251,INDIRECT(\"'\"&$I$1&\"'!\"&\"$C$2:$H$200\"),3,FALSE),\"\")","v":"M"},{"$f":"IFERROR(VLOOKUP(B251,INDIRECT(\"'\"&$I$1&\"'!\"&\"$C$2:$H$200\"),4,FALSE),\"\")","v":"M"},{"$f":"SUM(LARGE((H251,J251,L251,N251,P251,R251),{1,2,3,4}))","v":79.750884095928939},"",0,0.230625,79.750884095928939,"",0,"",0,"",0,"",0,1,79.750884095928939,null,{"$f":"COUNTIF(#REF!,'Series Table'!B251)>0","v":{"$error":"#REF!"}}]
[250,"Mark Jemmett",{"$f":"IFERROR(VLOOKUP(B252,INDIRECT(\"'\"&$I$1&\"'!\"&\"$C$2:$H$200\"),2,FALSE),\"\")","v":"Sully,Vog"},{"$f":"IFERROR(VLOOKUP(B252,INDIRECT(\"'\"&$I$1&\"'!\"&\"$C$2:$H$200\"),3,FALSE),\"\")","v":"M"},{"$f":"IFERROR(VLOOKUP(B252,INDIRECT(\"'\"&$I$1&\"'!\"&\"$C$2:$H$200\"),4,FALSE),\"\")","v":"M40"},{"$f":"SUM(LARGE((H252,J252,L252,N252,P252,R252),{1,2,3,4}))","v":79.732779742435397},"",0,0.23065972222222222,79.732779742435397,"",0,"",0,"",0,"",0,1,79.732779742435397,null,{"$f":"COUNTIF(#REF!,'Series Table'!B252)>0","v":{"$error":"#REF!"}}]
[251,"Anthony Howells",{"$f":"IFERROR(VLOOKUP(B253,INDIRECT(\"'\"&$M$1&\"'!\"&\"$C$2:$H$200\"),2,FALSE),\"\")","v":"Unattached"},{"$f":"IFERROR(VLOOKUP(B253,INDIRECT(\"'\"&$M$1&\"'!\"&\"$C$2:$H$200\"),3,FALSE),\"\")","v":"M"},{"$f":"IFERROR(VLOOKUP(B253,INDIRECT(\"'\"&$M$1&\"'!\"&\"$C$2:$H$200\"),4,FALSE),\"\")","v":"M50"},{"$f":"SUM(LARGE((H253,J253,L253,N253,P253,R253),{1,2,3,4}))","v":79.481002956312309},"",0,"",0,"",0,4.2465277777777775E-2,79.481002956312309,"",0,"",0,1,79.481002956312309,null,{"$f":"COUNTIF(#REF!,'Series Table'!B253)>0","v":{"$error":"#REF!"}}]
[252,"Anna Lawson",{"$f":"IFERROR(VLOOKUP(B254,INDIRECT(\"'\"&$M$1&\"'!\"&\"$C$2:$H$200\"),2,FALSE),\"\")","v":"Unattached"},{"$f":"IFERROR(VLOOKUP(B254,INDIRECT(\"'\"&$M$1&\"'!\"&\"$C$2:$H$200\"),3,FALSE),\"\")","v":"F"},{"$f":"IFERROR(VLOOKUP(B254,INDIRECT(\"'\"&$M$1&\"'!\"&\"$C$2:$H$200\"),4,FALSE),\"\")","v":"F"},{"$f":"SUM(LARGE((H254,J254,L254,N254,P254,R254),{1,2,3,4}))","v":79.218219643052691},"",0,"",0,"",0,4.2557870370370371E-2,79.218219643052691,"",0,"",0,1,79.218219643052691,null,{"$f":"COUNTIF(#REF!,'Series Table'!B254)>0","v":{"$error":"#REF!"}}]
[253,"Andrew Law",{"$f":"IFERROR(VLOOKUP(B255,INDIRECT(\"'\"&$M$1&\"'!\"&\"$C$2:$H$200\"),2,FALSE),\"\")","v":"Plumstead Runners"},{"$f":"IFERROR(VLOOKUP(B255,INDIRECT(\"'\"&$M$1&\"'!\"&\"$C$2:$H$200\"),3,FALSE),\"\")","v":"M"},{"$f":"IFERROR(VLOOKUP(B255,INDIRECT(\"'\"&$M$1&\"'!\"&\"$C$2:$H$200\"),4,FALSE),\"\")","v":"M40"},{"$f":"SUM(LARGE((H255,J255,L255,N255,P255,R255),{1,2,3,4}))","v":79.185371728895234},"",0,"",0,"",0,4.2569444444444444E-2,79.185371728895234,"",0,"",0,1,79.185371728895234,null,{"$f":"COUNTIF(#REF!,'Series Table'!B255)>0","v":{"$error":"#REF!"}}]
[254,"Llinos Davies",{"$f":"IFERROR(VLOOKUP(B256,INDIRECT(\"'\"&$I$1&\"'!\"&\"$C$2:$H$200\"),2,FALSE),\"\")","v":"Ystalyfera"},{"$f":"IFERROR(VLOOKUP(B256,INDIRECT(\"'\"&$I$1&\"'!\"&\"$C$2:$H$200\"),3,FALSE),\"\")","v":"F"},{"$f":"IFERROR(VLOOKUP(B256,INDIRECT(\"'\"&$I$1&\"'!\"&\"$C$2:$H$200\"),4,FALSE),\"\")","v":"F"},{"$f":"SUM(LARGE((H256,J256,L256,N256,P256,R256),{1,2,3,4}))","v":78.893944697234872},"",0,0.23226851851851851,78.893944697234872,"",0,"",0,"",0,"",0,1,78.893944697234872,null,{"$f":"COUNTIF(#REF!,'Series Table'!B256)>0","v":{"$error":"#REF!"}}]
[255,"Karlwinder Hayer",{"$f":"IFERROR(VLOOKUP(B257,INDIRECT(\"'\"&$M$1&\"'!\"&\"$C$2:$H$200\"),2,FALSE),\"\")","v":"London Frontrunners"},{"$f":"IFERROR(VLOOKUP(B257,INDIRECT(\"'\"&$M$1&\"'!\"&\"$C$2:$H$200\"),3,FALSE),\"\")","v":"M"},{"$f":"IFERROR(VLOOKUP(B257,INDIRECT(\"'\"&$M$1&\"'!\"&\"$C$2:$H$200\"),4,FALSE),\"\")","v":"M40"},{"$f":"SUM(LARGE((H257,J257,L257,N257,P257,R257),{1,2,3,4}))","v":78.42986970327388},"",0,"",0,"",0,4.2835648148148144E-2,78.42986970327388,"",0,"",0,1,78.42986970327388,null,{"$f":"COUNTIF(#REF!,'Series Table'!B257)>0","v":{"$error":"#REF!"}}]
[256,"Dawn Louise Roberts",{"$f":"IFERROR(VLOOKUP(B258,INDIRECT(\"'\"&$O$1&\"'!\"&\"$C$2:$H$200\"),2,FALSE),\"\")","v":"Unattached"},{"$f":"IFERROR(VLOOKUP(B258,INDIRECT(\"'\"&$O$1&\"'!\"&\"$C$2:$H$200\"),3,FALSE),\"\")","v":"F"},{"$f":"IFERROR(VLOOKUP(B258,INDIRECT(\"'\"&$O$1&\"'!\"&\"$C$2:$H$200\"),4,FALSE),\"\")","v":"F"},{"$f":"SUM(LARGE((H258,J258,L258,N258,P258,R258),{1,2,3,4}))","v":78.23461540605372},"",0,"",0,"",0,"",0,8.8494097222222221E-2,78.23461540605372,"",0,1,78.23461540605372,null,{"$f":"COUNTIF(#REF!,'Series Table'!B258)>0","v":{"$error":"#REF!"}}]
[257,"Clare Dallimore",{"$f":"IFERROR(VLOOKUP(B259,INDIRECT(\"'\"&$K$1&\"'!\"&\"$C$2:$H$200\"),2,FALSE),\"\")","v":"MDC"},{"$f":"IFERROR(VLOOKUP(B259,INDIRECT(\"'\"&$K$1&\"'!\"&\"$C$2:$H$200\"),3,FALSE),\"\")","v":"F"},{"$f":"IFERROR(VLOOKUP(B259,INDIRECT(\"'\"&$K$1&\"'!\"&\"$C$2:$H$200\"),4,FALSE),\"\")","v":"F"},{"$f":"SUM(LARGE((H259,J259,L259,N259,P259,R259),{1,2,3,4}))","v":77.634790326159305},{"$f":"IFERROR(VLOOKUP(B259,INDIRECT(\"'\"&$G$1&\"'!\"&\"$C$2:$H$200\"),5,FALSE),\"\")","v":""},{"$f":"IFERROR(VLOOKUP(B259,INDIRECT(\"'\"&$G$1&\"'!\"&\"$C$2:$H$200\"),6,FALSE),0)","v":0},{"$f":"IFERROR(VLOOKUP(B259,INDIRECT(\"'\"&$I$1&\"'!\"&\"$C$2:$G$200\"),5,FALSE),\"\")","v":""},{"$f":"IFERROR(VLOOKUP(B259,INDIRECT(\"'\"&$I$1&\"'!\"&\"$C$2:$H$200\"),6,FALSE),0)","v":0},{"$f":"IFERROR(VLOOKUP(B259,INDIRECT(\"'\"&$K$1&\"'!\"&\"$C$2:$H$200\"),5,FALSE),\"\")","v":"02:08:41"},{"$f":"IFERROR(VLOOKUP(B259,INDIRECT(\"'\"&$K$1&\"'!\"&\"$C$2:$H$200\"),6,FALSE),0)","v":77.634790326159305},{"$f":"IFERROR(VLOOKUP(B259,INDIRECT(\"'\"&$M$1&\"'!\"&\"$C$2:$h$200\"),5,FALSE),\"\")","v":""},{"$f":"IFERROR(VLOOKUP(B259,INDIRECT(\"'\"&$M$1&\"'!\"&\"$C$2:$h$200\"),6,FALSE),0)","v":0},{"$f":"IFERROR(VLOOKUP(B259,INDIRECT(\"'\"&$O$1&\"'!\"&\"$C$2:$h$200\"),5,FALSE),\"\")","v":""},{"$f":"IFERROR(VLOOKUP(B259,INDIRECT(\"'\"&$O$1&\"'!\"&\"$C$2:$h$200\"),6,FALSE),0)","v":0},{"$f":"IFERROR(VLOOKUP(B259,INDIRECT(\"'\"&$Q$1&\"'!\"&\"$C$2:$h$200\"),5,FALSE),\"\")","v":""},{"$f":"IFERROR(VLOOKUP(B259,INDIRECT(\"'\"&$Q$1&\"'!\"&\"$C$2:$h$200\"),6,FALSE),0)","v":0},{"$f":"6-COUNTIF(G259:Q259,\"\")","v":1},{"$f":"F259/IF(S259>4,4,S259)","v":77.634790326159305},null,{"$f":"COUNTIF(#REF!,'Series Table'!B259)>0","v":{"$error":"#REF!"}}]
[{"$f":"ROW(A258)","v":258},"Bridget Funnell",{"$f":"IFERROR(VLOOKUP(B260,INDIRECT(\"'\"&$I$1&\"'!\"&\"$C$2:$H$200\"),2,FALSE),\"\")","v":"Off-Roadents"},{"$f":"IFERROR(VLOOKUP(B260,INDIRECT(\"'\"&$I$1&\"'!\"&\"$C$2:$H$200\"),3,FALSE),\"\")","v":"F"},{"$f":"IFERROR(VLOOKUP(B260,INDIRECT(\"'\"&$I$1&\"'!\"&\"$C$2:$H$200\"),4,FALSE),\"\")","v":"F60"},{"$f":"SUM(LARGE((H260,J260,L260,N260,P260,R260),{1,2,3,4}))","v":77.542152969717478},"",0,0.2348611111111111,77.542152969717478,"",0,"",0,"",0,"",0,1,77.542152969717478,null,{"$f":"COUNTIF(#REF!,'Series Table'!B260)>0","v":{"$error":"#REF!"}}]
[259,"Roger Nosworthy",{"$f":"IFERROR(VLOOKUP(B261,INDIRECT(\"'\"&$I$1&\"'!\"&\"$C$2:$H$200\"),2,FALSE),\"\")","v":"Off-Roadents"},{"$f":"IFERROR(VLOOKUP(B261,INDIRECT(\"'\"&$I$1&\"'!\"&\"$C$2:$H$200\"),3,FALSE),\"\")","v":"M"},{"$f":"IFERROR(VLOOKUP(B261,INDIRECT(\"'\"&$I$1&\"'!\"&\"$C$2:$H$200\"),4,FALSE),\"\")","v":"M60"},{"$f":"SUM(LARGE((H261,J261,L261,N261,P261,R261),{1,2,3,4}))","v":77.511979047228223},"",0,0.23491898148148149,77.511979047228223,"",0,"",0,"",0,"",0,1,77.511979047228223,null,{"$f":"COUNTIF(#REF!,'Series Table'!B261)>0","v":{"$error":"#REF!"}}]
[260,"Jason Pittaway",{"$f":"IFERROR(VLOOKUP(B262,INDIRECT(\"'\"&$I$1&\"'!\"&\"$C$2:$H$200\"),2,FALSE),\"\")","v":"Bristol"},{"$f":"IFERROR(VLOOKUP(B262,INDIRECT(\"'\"&$I$1&\"'!\"&\"$C$2:$H$200\"),3,FALSE),\"\")","v":"M"},{"$f":"IFERROR(VLOOKUP(B262,INDIRECT(\"'\"&$I$1&\"'!\"&\"$C$2:$H$200\"),4,FALSE),\"\")","v":"M40"},{"$f":"SUM(LARGE((H262,J262,L262,N262,P262,R262),{1,2,3,4}))","v":77.228344175829463},"",0,0.23546296296296299,77.228344175829463,"",0,"",0,"",0,"",0,1,77.228344175829463,null,{"$f":"COUNTIF(#REF!,'Series Table'!B262)>0","v":{"$error":"#REF!"}}]
[261,"Imtiaz Ilahi",{"$f":"IFERROR(VLOOKUP(B263,INDIRECT(\"'\"&$I$1&\"'!\"&\"$C$2:$H$200\"),2,FALSE),\"\")","v":"Birmingham"},{"$f":"IFERROR(VLOOKUP(B263,INDIRECT(\"'\"&$I$1&\"'!\"&\"$C$2:$H$200\"),3,FALSE),\"\")","v":"M"},{"$f":"IFERROR(VLOOKUP(B263,INDIRECT(\"'\"&$I$1&\"'!\"&\"$C$2:$H$200\"),4,FALSE),\"\")","v":"M40"},{"$f":"SUM(LARGE((H263,J263,L263,N263,P263,R263),{1,2,3,4}))","v":77.08350934788119},"",0,0.23574074074074072,77.08350934788119,"",0,"",0,"",0,"",0,1,77.08350934788119,null,{"$f":"COUNTIF(#REF!,'Series Table'!B263)>0","v":{"$error":"#REF!"}}]
[262,"William Gold",{"$f":"IFERROR(VLOOKUP(B264,INDIRECT(\"'\"&$M$1&\"'!\"&\"$C$2:$H$200\"),2,FALSE),\"\")","v":"Unattached"},{"$f":"IFERROR(VLOOKUP(B264,INDIRECT(\"'\"&$M$1&\"'!\"&\"$C$2:$H$200\"),3,FALSE),\"\")","v":"M"},{"$f":"IFERROR(VLOOKUP(B264,INDIRECT(\"'\"&$M$1&\"'!\"&\"$C$2:$H$200\"),4,FALSE),\"\")","v":"M"},{"$f":"SUM(LARGE((H264,J264,L264,N264,P264,R264),{1,2,3,4}))","v":76.294755283039535},"",0,"",0,"",0,4.3587962962962967E-2,76.294755283039535,"",0,"",0,1,76.294755283039535,null,{"$f":"COUNTIF(#REF!,'Series Table'!B264)>0","v":{"$error":"#REF!"}}]
[263,"Gareth Jones",{"$f":"IFERROR(VLOOKUP(B265,INDIRECT(\"'\"&$O$1&\"'!\"&\"$C$2:$H$200\"),2,FALSE),\"\")","v":"MDC"},{"$f":"IFERROR(VLOOKUP(B265,INDIRECT(\"'\"&$O$1&\"'!\"&\"$C$2:$H$200\"),3,FALSE),\"\")","v":"M"},{"$f":"IFERROR(VLOOKUP(B265,INDIRECT(\"'\"&$O$1&\"'!\"&\"$C$2:$H$200\"),4,FALSE),\"\")","v":"M60"},{"$f":"SUM(LARGE((H265,J265,L265,N265,P265,R265),{1,2,3,4}))","v":75.934162508536801},"",0,"",0,"",0,"",0,9.0165972222222224E-2,75.934162508536801,"",0,1,75.934162508536801,null,{"$f":"COUNTIF(#REF!,'Series Table'!B265)>0","v":{"$error":"#REF!"}}]
[264,"Zoe Clancy",{"$f":"IFERROR(VLOOKUP(B266,INDIRECT(\"'\"&$I$1&\"'!\"&\"$C$2:$H$200\"),2,FALSE),\"\")","v":"Cowbridge"},{"$f":"IFERROR(VLOOKUP(B266,INDIRECT(\"'\"&$I$1&\"'!\"&\"$C$2:$H$200\"),3,FALSE),\"\")","v":"F"},{"$f":"IFERROR(VLOOKUP(B266,INDIRECT(\"'\"&$I$1&\"'!\"&\"$C$2:$H$200\"),4,FALSE),\"\")","v":"F40"},{"$f":"SUM(LARGE((H266,J266,L266,N266,P266,R266),{1,2,3,4}))","v":75.254969645033995},"",0,0.23924768518518516,75.254969645033995,"",0,"",0,"",0,"",0,1,75.254969645033995,null,{"$f":"COUNTIF(#REF!,'Series Table'!B266)>0","v":{"$error":"#REF!"}}]
[265,"Ed Goldsmith",{"$f":"IFERROR(VLOOKUP(B267,INDIRECT(\"'\"&$G$1&\"'!\"&\"$C$2:$H$200\"),2,FALSE),\"\")","v":"U/A"},{"$f":"IFERROR(VLOOKUP(B267,INDIRECT(\"'\"&$G$1&\"'!\"&\"$C$2:$H$200\"),3,FALSE),\"\")","v":"M"},{"$f":"IFERROR(VLOOKUP(B267,INDIRECT(\"'\"&$G$1&\"'!\"&\"$C$2:$H$200\"),4,FALSE),\"\")","v":"M"},{"$f":"SUM(LARGE((H267,J267,L267,N267,P267,R267),{1,2,3,4}))","v":72.460870380205591},"01:53:24",72.460870380205591,"",0,"",0,"",0,"",0,"",0,1,72.460870380205591,null,{"$f":"COUNTIF(#REF!,'Series Table'!B267)>0","v":{"$error":"#REF!"}}]
[266,"Anna Causer Nakamura",{"$f":"IFERROR(VLOOKUP(B268,INDIRECT(\"'\"&$G$1&\"'!\"&\"$C$2:$H$200\"),2,FALSE),\"\")","v":"U/A"},{"$f":"IFERROR(VLOOKUP(B268,INDIRECT(\"'\"&$G$1&\"'!\"&\"$C$2:$H$200\"),3,FALSE),\"\")","v":"F"},{"$f":"IFERROR(VLOOKUP(B268,INDIRECT(\"'\"&$G$1&\"'!\"&\"$C$2:$H$200\"),4,FALSE),\"\")","v":"F"},{"$f":"SUM(LARGE((H268,J268,L268,N268,P268,R268),{1,2,3,4}))","v":72.142210003436546},"01:53:41",72.142210003436546,"",0,"",0,"",0,"",0,"",0,1,72.142210003436546,null,{"$f":"COUNTIF(#REF!,'Series Table'!B268)>0","v":{"$error":"#REF!"}}]
[267,"Badar Al Raisi",{"$f":"IFERROR(VLOOKUP(B269,INDIRECT(\"'\"&$M$1&\"'!\"&\"$C$2:$H$200\"),2,FALSE),\"\")","v":"London Frontrunners"},{"$f":"IFERROR(VLOOKUP(B269,INDIRECT(\"'\"&$M$1&\"'!\"&\"$C$2:$H$200\"),3,FALSE),\"\")","v":"M"},{"$f":"IFERROR(VLOOKUP(B269,INDIRECT(\"'\"&$M$1&\"'!\"&\"$C$2:$H$200\"),4,FALSE),\"\")","v":"M"},{"$f":"SUM(LARGE((H269,J269,L269,N269,P269,R269),{1,2,3,4}))","v":71.860286871783657},"",0,"",0,"",0,4.5150462962962962E-2,71.860286871783657,"",0,"",0,1,71.860286871783657,null,{"$f":"COUNTIF(#REF!,'Series Table'!B269)>0","v":{"$error":"#REF!"}}]
[268,"Angela Price",{"$f":"IFERROR(VLOOKUP(B270,INDIRECT(\"'\"&$G$1&\"'!\"&\"$C$2:$H$200\"),2,FALSE),\"\")","v":"Hay Hotfooters"},{"$f":"IFERROR(VLOOKUP(B270,INDIRECT(\"'\"&$G$1&\"'!\"&\"$C$2:$H$200\"),3,FALSE),\"\")","v":"F"},{"$f":"IFERROR(VLOOKUP(B270,INDIRECT(\"'\"&$G$1&\"'!\"&\"$C$2:$H$200\"),4,FALSE),\"\")","v":"F40"},{"$f":"SUM(LARGE((H270,J270,L270,N270,P270,R270),{1,2,3,4}))","v":71.017526320722311},"01:54:41",71.017526320722311,"",0,"",0,"",0,"",0,"",0,1,71.017526320722311,null,{"$f":"COUNTIF(#REF!,'Series Table'!B270)>0","v":{"$error":"#REF!"}}]
[269,"Christopher Sexton",{"$f":"IFERROR(VLOOKUP(B271,INDIRECT(\"'\"&$I$1&\"'!\"&\"$C$2:$H$200\"),2,FALSE),\"\")","v":"Pembrokeshire Harriers"},{"$f":"IFERROR(VLOOKUP(B271,INDIRECT(\"'\"&$I$1&\"'!\"&\"$C$2:$H$200\"),3,FALSE),\"\")","v":"M"},{"$f":"IFERROR(VLOOKUP(B271,INDIRECT(\"'\"&$I$1&\"'!\"&\"$C$2:$H$200\"),4,FALSE),\"\")","v":"M50"},{"$f":"SUM(LARGE((H271,J271,L271,N271,P271,R271),{1,2,3,4}))","v":70.843542177108858},"",0,0.24770833333333334,70.843542177108858,"",0,"",0,"",0,"",0,1,70.843542177108858,null,{"$f":"COUNTIF(#REF!,'Series Table'!B271)>0","v":{"$error":"#REF!"}}]
[270,"Tom Davies",{"$f":"IFERROR(VLOOKUP(B272,INDIRECT(\"'\"&$M$1&\"'!\"&\"$C$2:$H$200\"),2,FALSE),\"\")","v":"Croft Ambrey"},{"$f":"IFERROR(VLOOKUP(B272,INDIRECT(\"'\"&$M$1&\"'!\"&\"$C$2:$H$200\"),3,FALSE),\"\")","v":"M"},{"$f":"IFERROR(VLOOKUP(B272,INDIRECT(\"'\"&$M$1&\"'!\"&\"$C$2:$H$200\"),4,FALSE),\"\")","v":"M60"},{"$f":"SUM(LARGE((H272,J272,L272,N272,P272,R272),{1,2,3,4}))","v":70.513522391328181},"",0,"",0,"",0,4.5624999999999999E-2,70.513522391328181,"",0,"",0,1,70.513522391328181,null,{"$f":"COUNTIF(#REF!,'Series Table'!B272)>0","v":{"$error":"#REF!"}}]
[271,"Tosh Simpkin",{"$f":"IFERROR(VLOOKUP(B273,INDIRECT(\"'\"&$M$1&\"'!\"&\"$C$2:$H$200\"),2,FALSE),\"\")","v":"Unattached"},{"$f":"IFERROR(VLOOKUP(B273,INDIRECT(\"'\"&$M$1&\"'!\"&\"$C$2:$H$200\"),3,FALSE),\"\")","v":"M"},{"$f":"IFERROR(VLOOKUP(B273,INDIRECT(\"'\"&$M$1&\"'!\"&\"$C$2:$H$200\"),4,FALSE),\"\")","v":"M40"},{"$f":"SUM(LARGE((H273,J273,L273,N273,P273,R273),{1,2,3,4}))","v":70.382130734698364},"",0,"",0,"",0,4.5671296296296293E-2,70.382130734698364,"",0,"",0,1,70.382130734698364,null,{"$f":"COUNTIF(#REF!,'Series Table'!B273)>0","v":{"$error":"#REF!"}}]
[272,"Ellie Salisbury",{"$f":"IFERROR(VLOOKUP(B274,INDIRECT(\"'\"&$M$1&\"'!\"&\"$C$2:$H$200\"),2,FALSE),\"\")","v":"Eryri"},{"$f":"IFERROR(VLOOKUP(B274,INDIRECT(\"'\"&$M$1&\"'!\"&\"$C$2:$H$200\"),3,FALSE),\"\")","v":"F"},{"$f":"IFERROR(VLOOKUP(B274,INDIRECT(\"'\"&$M$1&\"'!\"&\"$C$2:$H$200\"),4,FALSE),\"\")","v":"F50"},{"$f":"SUM(LARGE((H274,J274,L274,N274,P274,R274),{1,2,3,4}))","v":70.152195335596204},"",0,"",0,"",0,4.5752314814814815E-2,70.152195335596204,"",0,"",0,1,70.152195335596204,null,{"$f":"COUNTIF(#REF!,'Series Table'!B274)>0","v":{"$error":"#REF!"}}]
[273,"Dave Wilson",{"$f":"IFERROR(VLOOKUP(B275,INDIRECT(\"'\"&$I$1&\"'!\"&\"$C$2:$H$200\"),2,FALSE),\"\")","v":"Kilgetty"},{"$f":"IFERROR(VLOOKUP(B275,INDIRECT(\"'\"&$I$1&\"'!\"&\"$C$2:$H$200\"),3,FALSE),\"\")","v":"M"},{"$f":"IFERROR(VLOOKUP(B275,INDIRECT(\"'\"&$I$1&\"'!\"&\"$C$2:$H$200\"),4,FALSE),\"\")","v":"M"},{"$f":"SUM(LARGE((H275,J275,L275,N275,P275,R275),{1,2,3,4}))","v":70.089194114878168},"",0,0.24915509259259258,70.089194114878168,"",0,"",0,"",0,"",0,1,70.089194114878168,null,{"$f":"COUNTIF(#REF!,'Series Table'!B275)>0","v":{"$error":"#REF!"}}]
[274,"Sean McNally",{"$f":"IFERROR(VLOOKUP(B276,INDIRECT(\"'\"&$M$1&\"'!\"&\"$C$2:$H$200\"),2,FALSE),\"\")","v":"Unattached"},{"$f":"IFERROR(VLOOKUP(B276,INDIRECT(\"'\"&$M$1&\"'!\"&\"$C$2:$H$200\"),3,FALSE),\"\")","v":"M"},{"$f":"IFERROR(VLOOKUP(B276,INDIRECT(\"'\"&$M$1&\"'!\"&\"$C$2:$H$200\"),4,FALSE),\"\")","v":"M"},{"$f":"SUM(LARGE((H276,J276,L276,N276,P276,R276),{1,2,3,4}))","v":69.987955764808959},"",0,"",0,"",0,4.5810185185185183E-2,69.987955764808959,"",0,"",0,1,69.987955764808959,null,{"$f":"COUNTIF(#REF!,'Series Table'!B276)>0","v":{"$error":"#REF!"}}]
[275,"Robert Nelson",{"$f":"IFERROR(VLOOKUP(B277,INDIRECT(\"'\"&$I$1&\"'!\"&\"$C$2:$H$200\"),2,FALSE),\"\")","v":"Monmouth"},{"$f":"IFERROR(VLOOKUP(B277,INDIRECT(\"'\"&$I$1&\"'!\"&\"$C$2:$H$200\"),3,FALSE),\"\")","v":"M"},{"$f":"IFERROR(VLOOKUP(B277,INDIRECT(\"'\"&$I$1&\"'!\"&\"$C$2:$H$200\"),4,FALSE),\"\")","v":"M40"},{"$f":"SUM(LARGE((H277,J277,L277,N277,P277,R277),{1,2,3,4}))","v":69.980567993916935},"",0,0.24936342592592595,69.980567993916935,"",0,"",0,"",0,"",0,1,69.980567993916935,null,{"$f":"COUNTIF(#REF!,'Series Table'!B277)>0","v":{"$error":"#REF!"}}]
[276,"Adrian Moir",{"$f":"IFERROR(VLOOKUP(B278,INDIRECT(\"'\"&$M$1&\"'!\"&\"$C$2:$H$200\"),2,FALSE),\"\")","v":"MDC"},{"$f":"IFERROR(VLOOKUP(B278,INDIRECT(\"'\"&$M$1&\"'!\"&\"$C$2:$H$200\"),3,FALSE),\"\")","v":"M"},{"$f":"IFERROR(VLOOKUP(B278,INDIRECT(\"'\"&$M$1&\"'!\"&\"$C$2:$H$200\"),4,FALSE),\"\")","v":"M50"},{"$f":"SUM(LARGE((H278,J278,L278,N278,P278,R278),{1,2,3,4}))","v":68.148472571991704},"",0,"",0,"",0,4.6458333333333331E-2,68.148472571991704,"",0,"",0,1,68.148472571991704,null,{"$f":"COUNTIF(#REF!,'Series Table'!B278)>0","v":{"$error":"#REF!"}}]
[277,"Richard Cronin",{"$f":"IFERROR(VLOOKUP(B279,INDIRECT(\"'\"&$O$1&\"'!\"&\"$C$2:$H$200\"),2,FALSE),\"\")","v":"MDC"},{"$f":"IFERROR(VLOOKUP(B279,INDIRECT(\"'\"&$O$1&\"'!\"&\"$C$2:$H$200\"),3,FALSE),\"\")","v":"M"},{"$f":"IFERROR(VLOOKUP(B279,INDIRECT(\"'\"&$O$1&\"'!\"&\"$C$2:$H$200\"),4,FALSE),\"\")","v":"M"},{"$f":"SUM(LARGE((H279,J279,L279,N279,P279,R279),{1,2,3,4}))","v":67.746811628554511},"",0,"",0,"",0,"",0,9.6116203703703704E-2,67.746811628554511,"",0,1,67.746811628554511,null,{"$f":"COUNTIF(#REF!,'Series Table'!B279)>0","v":{"$error":"#REF!"}}]
[278,"Andrew Leah",{"$f":"IFERROR(VLOOKUP(B280,INDIRECT(\"'\"&$M$1&\"'!\"&\"$C$2:$H$200\"),2,FALSE),\"\")","v":"Ryde Harriers"},{"$f":"IFERROR(VLOOKUP(B280,INDIRECT(\"'\"&$M$1&\"'!\"&\"$C$2:$H$200\"),3,FALSE),\"\")","v":"M"},{"$f":"IFERROR(VLOOKUP(B280,INDIRECT(\"'\"&$M$1&\"'!\"&\"$C$2:$H$200\"),4,FALSE),\"\")","v":"M50"},{"$f":"SUM(LARGE((H280,J280,L280,N280,P280,R280),{1,2,3,4}))","v":67.622905945472468},"",0,"",0,"",0,4.6643518518518522E-2,67.622905945472468,"",0,"",0,1,67.622905945472468,null,{"$f":"COUNTIF(#REF!,'Series Table'!B280)>0","v":{"$error":"#REF!"}}]
[279,"John Addams Williams",{"$f":"IFERROR(VLOOKUP(B281,INDIRECT(\"'\"&$I$1&\"'!\"&\"$C$2:$H$200\"),2,FALSE),\"\")","v":"Mepal/Cambs"},{"$f":"IFERROR(VLOOKUP(B281,INDIRECT(\"'\"&$I$1&\"'!\"&\"$C$2:$H$200\"),3,FALSE),\"\")","v":"M"},{"$f":"IFERROR(VLOOKUP(B281,INDIRECT(\"'\"&$I$1&\"'!\"&\"$C$2:$H$200\"),4,FALSE),\"\")","v":"M40"},{"$f":"SUM(LARGE((H281,J281,L281,N281,P281,R281),{1,2,3,4}))","v":66.957140960496304},"",0,0.25516203703703705,66.957140960496304,"",0,"",0,"",0,"",0,1,66.957140960496304,null,{"$f":"COUNTIF(#REF!,'Series Table'!B281)>0","v":{"$error":"#REF!"}}]
[280,"Leigh Ally","Walsall","M","M",{"$f":"SUM(LARGE((H282,J282,L282,N282,P282,R282),{1,2,3,4}))","v":66.800236563552346},"",0,0.25546296296296295,66.800236563552346,"",0,"",0,"",0,"",0,1,66.800236563552346,null,{"$f":"COUNTIF(#REF!,'Series Table'!B282)>0","v":{"$error":"#REF!"}}]
[281,"Darren Mutter","Narberth","M","M40",{"$f":"SUM(LARGE((H283,J283,L283,N283,P283,R283),{1,2,3,4}))","v":64.054409617032576},"",0,0.26072916666666668,64.054409617032576,"",0,"",0,"",0,"",0,1,64.054409617032576,null,{"$f":"COUNTIF(#REF!,'Series Table'!B283)>0","v":{"$error":"#REF!"}}]
[282,"Alex Jungmayr","Tresaith","M","M",{"$f":"SUM(LARGE((H284,J284,L284,N284,P284,R284),{1,2,3,4}))","v":63.692322547161837},"",0,0.26142361111111112,63.692322547161837,"",0,"",0,"",0,"",0,1,63.692322547161837,null,{"$f":"COUNTIF(#REF!,'Series Table'!B284)>0","v":{"$error":"#REF!"}}]
[283,"Ellen Wakelam","Tresaith","F","F",{"$f":"SUM(LARGE((H285,J285,L285,N285,P285,R285),{1,2,3,4}))","v":63.330235477291112},"",0,0.26211805555555556,63.330235477291112,"",0,"",0,"",0,"",0,1,63.330235477291112,null,{"$f":"COUNTIF(#REF!,'Series Table'!B285)>0","v":{"$error":"#REF!"}}]
[284,"Robert Ivor Chapman","Pontcanna, Cardiff","M","M50",{"$f":"SUM(LARGE((H286,J286,L286,N286,P286,R286),{1,2,3,4}))","v":63.330235477291112},"",0,0.26211805555555556,63.330235477291112,"",0,"",0,"",0,"",0,1,63.330235477291112,null,{"$f":"COUNTIF(#REF!,'Series Table'!B286)>0","v":{"$error":"#REF!"}}]
[285,"John Nash",{"$f":"IFERROR(VLOOKUP(B287,INDIRECT(\"'\"&$K$1&\"'!\"&\"$C$2:$H$200\"),2,FALSE),\"\")","v":"Chepstow Harriers"},{"$f":"IFERROR(VLOOKUP(B287,INDIRECT(\"'\"&$K$1&\"'!\"&\"$C$2:$H$200\"),3,FALSE),\"\")","v":"M"},{"$f":"IFERROR(VLOOKUP(B287,INDIRECT(\"'\"&$K$1&\"'!\"&\"$C$2:$H$200\"),4,FALSE),\"\")","v":"M50"},{"$f":"SUM(LARGE((H287,J287,L287,N287,P287,R287),{1,2,3,4}))","v":62.562997242384853},"",0,"",0,"02:24:32",62.562997242384853,"",0,"",0,"",0,1,62.562997242384853,null,{"$f":"COUNTIF(#REF!,'Series Table'!B287)>0","v":{"$error":"#REF!"}}]
[286,"Wendy Sharpe-Nash",{"$f":"IFERROR(VLOOKUP(B288,INDIRECT(\"'\"&$K$1&\"'!\"&\"$C$2:$H$200\"),2,FALSE),\"\")","v":"Chepstow Harriers"},{"$f":"IFERROR(VLOOKUP(B288,INDIRECT(\"'\"&$K$1&\"'!\"&\"$C$2:$H$200\"),3,FALSE),\"\")","v":"F"},{"$f":"IFERROR(VLOOKUP(B288,INDIRECT(\"'\"&$K$1&\"'!\"&\"$C$2:$H$200\"),4,FALSE),\"\")","v":"F50"},{"$f":"SUM(LARGE((H288,J288,L288,N288,P288,R288),{1,2,3,4}))","v":62.547148879520755},"",0,"",0,"02:24:33",62.547148879520755,"",0,"",0,"",0,1,62.547148879520755,null,{"$f":"COUNTIF(#REF!,'Series Table'!B288)>0","v":{"$error":"#REF!"}}]
[287,"Paul Johnson",{"$f":"IFERROR(VLOOKUP(B289,INDIRECT(\"'\"&$I$1&\"'!\"&\"$C$2:$H$200\"),2,FALSE),\"\")","v":"Begelly"},{"$f":"IFERROR(VLOOKUP(B289,INDIRECT(\"'\"&$I$1&\"'!\"&\"$C$2:$H$200\"),3,FALSE),\"\")","v":"M"},{"$f":"IFERROR(VLOOKUP(B289,INDIRECT(\"'\"&$I$1&\"'!\"&\"$C$2:$H$200\"),4,FALSE),\"\")","v":"M50"},{"$f":"SUM(LARGE((H289,J289,L289,N289,P289,R289),{1,2,3,4}))","v":62.394843880125059},"",0,0.26391203703703703,62.394843880125059,"",0,"",0,"",0,"",0,1,62.394843880125059,null,{"$f":"COUNTIF(#REF!,'Series Table'!B289)>0","v":{"$error":"#REF!"}}]
[288,"Tim Peachey",{"$f":"IFERROR(VLOOKUP(B290,INDIRECT(\"'\"&$M$1&\"'!\"&\"$C$2:$H$200\"),2,FALSE),\"\")","v":"Unattached"},{"$f":"IFERROR(VLOOKUP(B290,INDIRECT(\"'\"&$M$1&\"'!\"&\"$C$2:$H$200\"),3,FALSE),\"\")","v":"M"},{"$f":"IFERROR(VLOOKUP(B290,INDIRECT(\"'\"&$M$1&\"'!\"&\"$C$2:$H$200\"),4,FALSE),\"\")","v":"M50"},{"$f":"SUM(LARGE((H290,J290,L290,N290,P290,R290),{1,2,3,4}))","v":60.133581517573667},"",0,"",0,"",0,4.9282407407407407E-2,60.133581517573667,"",0,"",0,1,60.133581517573667,null,{"$f":"COUNTIF(#REF!,'Series Table'!B290)>0","v":{"$error":"#REF!"}}]
[289,"Nicholas Michael Owen",{"$f":"IFERROR(VLOOKUP(B291,INDIRECT(\"'\"&$G$1&\"'!\"&\"$C$2:$H$200\"),2,FALSE),\"\")","v":"U/A"},{"$f":"IFERROR(VLOOKUP(B291,INDIRECT(\"'\"&$G$1&\"'!\"&\"$C$2:$H$200\"),3,FALSE),\"\")","v":"M"},{"$f":"IFERROR(VLOOKUP(B291,INDIRECT(\"'\"&$G$1&\"'!\"&\"$C$2:$H$200\"),4,FALSE),\"\")","v":"M50"},{"$f":"SUM(LARGE((H291,J291,L291,N291,P291,R291),{1,2,3,4}))","v":59.358305476584739},"02:05:03",59.358305476584739,"",0,"",0,"",0,"",0,"",0,1,59.358305476584739,null,{"$f":"COUNTIF(#REF!,'Series Table'!B291)>0","v":{"$error":"#REF!"}}]
[290,"Callum McGiem",{"$f":"IFERROR(VLOOKUP(B292,INDIRECT(\"'\"&$G$1&\"'!\"&\"$C$2:$H$200\"),2,FALSE),\"\")","v":"U/A"},{"$f":"IFERROR(VLOOKUP(B292,INDIRECT(\"'\"&$G$1&\"'!\"&\"$C$2:$H$200\"),3,FALSE),\"\")","v":"M"},{"$f":"IFERROR(VLOOKUP(B292,INDIRECT(\"'\"&$G$1&\"'!\"&\"$C$2:$H$200\"),4,FALSE),\"\")","v":"M"},{"$f":"SUM(LARGE((H292,J292,L292,N292,P292,R292),{1,2,3,4}))","v":58.252366521915718},"02:06:02",58.252366521915718,"",0,"",0,"",0,"",0,"",0,1,58.252366521915718,null,{"$f":"COUNTIF(#REF!,'Series Table'!B292)>0","v":{"$error":"#REF!"}}]
[291,"Matt Lister",{"$f":"IFERROR(VLOOKUP(B293,INDIRECT(\"'\"&$G$1&\"'!\"&\"$C$2:$H$200\"),2,FALSE),\"\")","v":"U/A"},{"$f":"IFERROR(VLOOKUP(B293,INDIRECT(\"'\"&$G$1&\"'!\"&\"$C$2:$H$200\"),3,FALSE),\"\")","v":"M"},{"$f":"IFERROR(VLOOKUP(B293,INDIRECT(\"'\"&$G$1&\"'!\"&\"$C$2:$H$200\"),4,FALSE),\"\")","v":"M"},{"$f":"SUM(LARGE((H293,J293,L293,N293,P293,R293),{1,2,3,4}))","v":58.008685057327661},"02:06:15",58.008685057327661,"",0,"",0,"",0,"",0,"",0,1,58.008685057327661,null,{"$f":"COUNTIF(#REF!,'Series Table'!B293)>0","v":{"$error":"#REF!"}}]
[292,"Lisa Sammons",{"$f":"IFERROR(VLOOKUP(B294,INDIRECT(\"'\"&$G$1&\"'!\"&\"$C$2:$H$200\"),2,FALSE),\"\")","v":"Oxford City Ac"},{"$f":"IFERROR(VLOOKUP(B294,INDIRECT(\"'\"&$G$1&\"'!\"&\"$C$2:$H$200\"),3,FALSE),\"\")","v":"F"},{"$f":"IFERROR(VLOOKUP(B294,INDIRECT(\"'\"&$G$1&\"'!\"&\"$C$2:$H$200\"),4,FALSE),\"\")","v":"F"},{"$f":"SUM(LARGE((H294,J294,L294,N294,P294,R294),{1,2,3,4}))","v":57.821237776875293},"02:06:25",57.821237776875293,"",0,"",0,"",0,"",0,"",0,1,57.821237776875293,null,{"$f":"COUNTIF(#REF!,'Series Table'!B294)>0","v":{"$error":"#REF!"}}]
[293,"Margaret Oliver",{"$f":"IFERROR(VLOOKUP(B295,INDIRECT(\"'\"&$M$1&\"'!\"&\"$C$2:$H$200\"),2,FALSE),\"\")","v":"Eryri"},{"$f":"IFERROR(VLOOKUP(B295,INDIRECT(\"'\"&$M$1&\"'!\"&\"$C$2:$H$200\"),3,FALSE),\"\")","v":"F"},{"$f":"IFERROR(VLOOKUP(B295,INDIRECT(\"'\"&$M$1&\"'!\"&\"$C$2:$H$200\"),4,FALSE),\"\")","v":"F60"},{"$f":"SUM(LARGE((H295,J295,L295,N295,P295,R295),{1,2,3,4}))","v":56.586006788568952},"",0,"",0,"",0,5.0532407407407408E-2,56.586006788568952,"",0,"",0,1,56.586006788568952,null,{"$f":"COUNTIF(#REF!,'Series Table'!B295)>0","v":{"$error":"#REF!"}}]
[294,"Claire Campbell",{"$f":"IFERROR(VLOOKUP(B296,INDIRECT(\"'\"&$M$1&\"'!\"&\"$C$2:$H$200\"),2,FALSE),\"\")","v":"Glossopdale Harriers"},{"$f":"IFERROR(VLOOKUP(B296,INDIRECT(\"'\"&$M$1&\"'!\"&\"$C$2:$H$200\"),3,FALSE),\"\")","v":"F"},{"$f":"IFERROR(VLOOKUP(B296,INDIRECT(\"'\"&$M$1&\"'!\"&\"$C$2:$H$200\"),4,FALSE),\"\")","v":"F40"},{"$f":"SUM(LARGE((H296,J296,L296,N296,P296,R296),{1,2,3,4}))","v":53.268367458666411},"",0,"",0,"",0,5.1701388888888887E-2,53.268367458666411,"",0,"",0,1,53.268367458666411,null,{"$f":"COUNTIF(#REF!,'Series Table'!B296)>0","v":{"$error":"#REF!"}}]
[295,"Rosie Eldridge",{"$f":"IFERROR(VLOOKUP(B297,INDIRECT(\"'\"&$M$1&\"'!\"&\"$C$2:$H$200\"),2,FALSE),\"\")","v":"Ryde Harriers"},{"$f":"IFERROR(VLOOKUP(B297,INDIRECT(\"'\"&$M$1&\"'!\"&\"$C$2:$H$200\"),3,FALSE),\"\")","v":"F"},{"$f":"IFERROR(VLOOKUP(B297,INDIRECT(\"'\"&$M$1&\"'!\"&\"$C$2:$H$200\"),4,FALSE),\"\")","v":"F"},{"$f":"SUM(LARGE((H297,J297,L297,N297,P297,R297),{1,2,3,4}))","v":53.202671630351503},"",0,"",0,"",0,5.1724537037037034E-2,53.202671630351503,"",0,"",0,1,53.202671630351503,null,{"$f":"COUNTIF(#REF!,'Series Table'!B297)>0","v":{"$error":"#REF!"}}]

{"sheet":"Torpantau","index":2,"n_rows":90,"n_cols":12,"rows_kept":90,"cut":false,"hidden":false,"merged":[]}
["Position","Number","Name","Club","Gender","Category","Time","Points"]
[1,{"$f":"ROW(A1)","v":1},"Dan Doherty","Mynydd Du","M","M","01:03:35",{"$f":"(2-(G2/L$10))*100","v":128.48886250741981}]
[{"$f":"A2+1","v":2},{"$f":"ROW(A2)","v":2},"Nathan Brickman","Belpher Harriers","M","M","01:14:00",116.77340747914648,null,"Number of runners","Position","Time (min.sec)"]
[{"$f":"A3+1","v":3},3,"Mark Lunt","Westbury Harriers","M","M","01:14:06",116.66093911087509,null,{"$f":"COUNT(B2:B201)","v":44},{"$f":"K6+2","v":24},{"$f":"VLOOKUP(K4,A2:G201,7,FALSE)","v":"01:29:55"}]
[4,4,"Tom Molleskin","Mynydd Du","M","M","01:20:15",109.74413446218252,null,{"$f":"ISEVEN(J4)","v":true},{"$f":"K6+1","v":23},"01:29:25"]
[5,5,"Brad Johnson","U/A","M","M","01:20:16",109.72538973413731,null,null,{"$f":"IF(J5 = TRUE,(J4/2),((J4+1)/2))","v":22},"01:28:57"]
[6,6,"Daniel Lewis","Wye Valley","M","M40","01:20:17",109.70664500609205,null,null,{"$f":"K6-1","v":21},"01:28:48"]
[7,7,"Andy Pritchard","Buckley Runners","M","M40","01:20:18",109.6879002780468,null,null,{"$f":"K6-2","v":20},"01:28:26"]
[8,8,"Karie Atkins","Chepstow","M","M40","01:20:41",109.25677153300634,null,null,{"$f":"IF(J5 = TRUE, K6-3, Na)","v":19},"01:27:58"]
[9,9,"Nick Biggs","Vegan Runners","M","M40","01:20:49",109.10681370864445,null,null,null,{"$f":"IF(J5=TRUE,AVERAGE(L4:L9),AVERAGE(L4:L8))","v":"01:28:54.833"}]
[10,10,"Paul Jeggo","Springfield","M","M50","01:21:16",108.60070605142305]
[11,11,"Paul Tucker","Brecon","M","M50","01:21:36",108.22581149051831]
[12,12,"John Hallett","MDC","M","M","01:21:38",108.18832203442783]
[13,13,"Hayley Evans","Buckley Runners","F","F","01:22:44",106.95116998344218,null,"Retired"]
[14,14,"George Fisher","1 Rifles","M","U23","01:22:44",106.95116998344218,null,"Iwan Murton"]
[15,15,"Ben Arkell","MDC","M","U23","01:26:44",102.45243525258523,null,"Shona Thornhill"]
[16,16,"Paul Chester","Wfra","M","M40","01:26:52",102.30247742822331,null,"Oscar Partridge"]
[17,17,"James Woodier","Mynydd Du","M","M","01:26:54",102.26498797213286]
[18,18,"Chris Chambers","Mynydd Du","M","M40","01:27:53",101.15904901746384]
[19,19,"Max Burns","1 Rifles","M","M","01:27:58",101.06532537723764]
[20,20,"Jeremy Jehan","Wye Valley","M","M40","01:28:26",100.54047299197101]
[21,21,"Richard Smith","Dursley","M","M","01:28:48",100.12808897497578]
[22,22,"Tony Wooldridge","Dursley","M","M60","01:28:57",99.95938642256867]
[23,23,"Emma Mcwilliams","Mynydd Du","F","F","01:29:25",99.434534037302001]
[24,24,"Steve Harrhy","Pontypool","M","M50","01:29:55",98.872192195944891]
[25,25,"Rona Davies","Mynydd Du","F","F50","01:30:10",98.591021275266357]
[26,26,"Sasha Habgood","MDC","F","F40","01:35:28",92.630197756880889]
[27,27,"Martin Carter","Hay Hotfooters","M","M50","01:35:31",92.573963572745186]
[28,28,"David York","Tattenhall","M","M50","01:39:15",88.375144490612016]
[29,29,"Tim Buckley","Chepstow","M","M50","01:39:40",87.906526289481107]
[30,30,"Neil Grant","Chepstow","M","M60","01:41:06",86.294479677590701]
[31,31,"Bev Tucker","Brecon","F","F50","01:41:55",85.375988003374076]
[32,32,"Wyn Davies","Mynydd Du","M","M50","01:42:33",84.663688337655074]
[33,33,"Joc Dodd","Chepstow","F","F60","01:43:04",84.082601768252687]
[34,34,"Stuart Duncan","Chepstow","M","M50","01:43:47",83.276578462307498]
[35,35,"Karen Elvers","MDC","F","F40","01:48:18",78.196757162048186]
[36,36,"John Price","Hay Hotfooters","M","M","01:49:48",76.509731637976827]
[37,37,"Les Williams","Eryri","M","M70","01:52:16",73.735511887281731]
[38,38,"Ed Goldsmith","U/A","M","M","01:53:24",72.460870380205591]
[39,39,"Anna Causer Nakamura","U/A","F","F","01:53:41",72.142210003436546]
[40,40,"Angela Price","Hay Hotfooters","F","F40","01:54:41",71.017526320722311]
[41,41,"Nicholas Michael Owen","U/A","M","M50","02:05:03",59.358305476584739]
[42,42,"Callum McGiem","U/A","M","M","02:06:02",58.252366521915718]
[43,43,"Matt Lister","U/A","M","M","02:06:15",58.008685057327661]
[44,{"$f":"ROW(A44)","v":44},"Lisa Sammons","Oxford City Ac","F","F","02:06:25",57.821237776875293]
[45,null,"",""]
[46,null,"",""]
[47,null,"",""]
[48,null,"",""]
[49,null,"",""]
[50,null,"",""]
[51,null,"",""]
[52,null,"",""]
[53,null,"",""]
[54,null,"",""]
[55,null,"",""]
[56,null,"",""]
[57,null,"",""]
[58,null,"",""]
[59,null,"",""]
[60,null,"",""]
[61,null,"",""]
[62,null,"",""]
[63,null,"",""]
[64,null,"",""]
[65,null,"",""]
[66,null,"",""]
[{"$f":"A67+1","v":67},null,"",""]
[68,null,"",""]
[69,null,"",""]
[70,null,"",""]
[71,null,"",""]
[72,null,"",""]
[73,null,"",""]
[74,null,"",""]
[75,null,"",""]
[76,null,"",""]
[77,null,"",""]
[78,null,"",""]
[79,null,"",""]
[80,null,"",""]
[81,null,"",""]
[82,null,"",""]
[83,null,"",""]
[84,null,"",""]
[85,null,"",""]
[86,null,"",""]
[87,null,"",""]
[88,null,"",""]
[89,null,"",""]

{"sheet":"Preseli Beast","index":3,"n_rows":136,"n_cols":12,"rows_kept":136,"cut":false,"hidden":false,"merged":[]}
["Position","Number","Name","Club","Gender","Category","Time","Points"]
[1,10,"Dan Doherty","Mynydd Du","M","M","03:05:35",{"$f":"(2-(G2/L$10))*100","v":132.80267461648944}]
[2,85,"Jez Brown","Buckley Runners","M","M40","03:06:12",{"$f":"(2-(G3/L$10))*100","v":132.57938759006916},null,"Number of runners","Position","Time (hr.min.sec)"]
[3,15,"Dylan Griffiths","Rhedwyr Hebog","M","M","03:17:38",128.4395254245471,null,135,{"$f":"K6+2","v":70},{"$f":"VLOOKUP(K4,A2:G201,7,FALSE)","v":"04:38:20"}]
[4,110,"Daryl John","Trots","M","M40","03:24:14",126.04975076340024,null,"Was it an even field?",{"$f":"K6+1","v":69},"04:36:00"]
[5,101,"Daniel Hooper","Cwmdu, Llandeilo","M","M40","03:27:09",124.99366347627725,null,{"$f":"ISEVEN(J4)","v":false},{"$f":"IF(J6 = TRUE,(J4/2),((J4+1)/2))","v":68},"04:35:44"]
[6,164,"Balazs Pinter","Aberystwyth Ac","M","M40","03:32:14",123.15305420443434,null,null,{"$f":"K6-1","v":67},"04:35:43"]
[7,14,"Samuel Gregory","Machen","M","M","03:33:03",122.85734976403992,null,null,{"$f":"K6-2","v":66},"04:35:06"]
[8,91,"Little Dave Cumins","Ddmt/Kom/Ttb","M","M40","03:35:05",122.12110605530277,null,null,{"$f":"IF(J6 = TRUE, K6-3, Na)","v":{"$error":"#NAME?"}},{"$error":"#NAME?"}]
[9,100,"Sam Hawking","Neath","M","M40","03:36:03",121.77108855442773,null,null,null,{"$f":"IF(J6=TRUE,AVERAGE(L4:L9),AVERAGE(L4:L8))","v":"04:36:10.600"}]
[10,20,"Afan Humphries","Caerphilly","M","M","03:42:33",119.41752260026797]
[11,52,"Sian Williams","Rhedwyr Hebog","F","F","03:43:13",119.17613122035414]
[12,115,"Daniel Lewis","Wye Valley Runners","M","M40","03:45:05",118.50023535659543]
[13,69,"Paul Jeggo","Chelmsford","M","M50","03:47:41",117.55880897493152]
[14,47,"Nerys Jones","Parcllyn, Ceredigion","F","F","03:47:58",117.45621763846815]
[15,75,"David Powell","Aberystwyth Ac","M","M50","03:48:05",117.41397414698321]
[16,7,"Dee Buchanan","San Domenico","M","M","03:49:29",116.9070522491642]
[17,163,"Patrick Swann","U/A","M","M40","03:49:34",116.87687832667497]
[18,128,"Simon Roberts","Chester Ac","M","M40","03:52:23",115.85699974653907]
[19,45,"Hayley Evans","Buckley Runners","F","F","03:53:02",115.6216431511231]
[20,165,"Gary Davies","MDC","M","M","03:57:01",114.17932965613798]
[21,12,"Will Feline","Stubbington Green","M","M","03:57:23",114.04656439718539]
[22,102,"Andrew Hughes","Rhedwyr Preseli","M","M40","03:59:34",113.25600762796762]
[23,54,"John Aggleton","MDC","M","M60","03:59:42",113.20772935198484]
[24,131,"Leigh Searle","Treorchy","M","M40","04:00:17",112.99651189456026]
[25,27,"Ruben Lightfoot","Cwm Cych","M","M","04:06:20",110.80588512184231]
[26,124,"Andy Pritchard","Buckley Runners","M","M40","04:07:00",110.56449374192849]
[27,157,"Tasha Sexton","Pembrokeshire Harriers","F","F40","04:08:15",110.11188490459007]
[28,61,"Paul Beeson","Maldwyn Harriers","M","M50","04:08:17",110.09981533559437]
[29,125,"Conrad Rees","Manorbier Newton","M","M40","04:08:49",109.90670223166332]
[30,158,"Sarah Tagg","West Coast Tri","F","F40","04:09:34",109.63513692926026]
[31,4,"Wayne Billman","Blandford Camp","M","M","04:09:43",109.58082386877965]
[32,99,"Martin Everett","Narberth","M","M40","04:10:36",109.26098029039383]
[33,92,"Nigel Davies","Sarn Helen","M","M40","04:10:41",109.23080636790461]
[34,133,"Darren Thomas","Spittal","M","M40","04:12:17",108.65146705611144]
[35,107,"Jeremy Jehan","Wye Valley Runners","M","M40","04:12:24",108.6092235646265]
[36,87,"John Cherry","Upper Killay","M","M40","04:14:39",107.79452765741735]
[37,67,"Glyn Fletcher","Maldwyn Harriers","M","M50","04:15:49",107.37209274256819]
[38,23,"Braddon Johnson","Stonehouse","M","M","04:16:36",107.08845787116942]
[39,154,"Sophie Noot","Team Cemais","F","F40","04:18:25",106.43066636090425]
[40,64,"Andrew Clement","Trots","M","M50","04:18:38",106.35221416243228]
[41,34,"James Roberts","Pemb Dock","M","M","04:19:11",106.15306627400336]
[42,19,"Llifon Howell","West Coast Tri","M","M","04:19:17",106.1168575670163]
[43,167,"Heddwyn Evans","Cardigan Running Club","M","M","04:19:25",106.0685792910335]
[44,38,"Michael Smith","Worcester","M","M","04:20:27",105.69442265216709]
[45,35,"Jonathan Roberts","Pemb Dock","M","M","04:21:07",105.45303127225327]
[46,146,"Louise Barker","Aberystwyth Ac","F","F40","04:21:26",105.33837036679421]
[47,62,"Phil Carter","Pembrokeshire Tri","M","M50","04:22:53",104.81334411548163]
[48,31,"Steven Plumb","Carmarthen","M","M","04:23:15",104.68057885652904]
[49,137,"Jason Wilkins","Rhedwyr Preseli","M","M40","04:23:33",104.57195273556783]
[50,80,"Paul Tucker","Mynydd Du","M","M50","04:25:38",103.81760467333712]
[51,155,"Rhian Probert","Mynydd Du","F","F40","04:25:58",103.69690898338023]
[52,2,"Luke Baines","Narberth","M","M","04:27:27",103.15981316307197]
[53,65,"Nick Davies","Rhedwyr Preseli","M","M50","04:28:06",102.92445656765597]
[54,28,"Gareth Morris","Buckley Runners","M","M","04:28:12",102.8882478606689]
[55,76,"John Rees","Rhedwyr Preseli","M","M50","04:28:37",102.73737824822275]
[56,126,"Nicky Rees","Five Frogs","M","M40","04:29:53",102.27873462638651]
[57,129,"Steve Rogers","Five Frogs","M","M40","04:29:54",102.27269984188867]
[58,136,"Chris Welton","Rhedwyr Preseli","M","M40","04:30:14",102.15200415193175]
[59,141,"Rona Davies","Mynydd Du","F","F50","04:31:43",101.61490833162348]
[60,90,"Ainslie Corp","Penffordd","M","M40","04:31:58",101.5243865641558]
[61,56,"Lawrie Jones","Fra","M","M60","04:32:10",101.45196915018167]
[62,48,"Emma McWilliams","Mynydd Du","F","F","04:33:03",101.13212557179585]
[63,26,"Dafydd Lewis","Whitland","M","M","04:33:13",101.07177772681739]
[64,152,"Domi Kimber","Rhedwyr Preseli","F","F40","04:33:24",101.00539509734108]
[65,41,"Ben Woods","Newcastle Emlyn","M","M","04:33:32",100.95711682135833]
[66,21,"Dafydd James","Newcastle Emlyn","M","M","04:35:06",{"$f":"(2-(G67/L$10))*100","v":100.38984707856082}]
[67,50,"Laura Wainwright","Stubbington Green","F","F","04:35:43",100.16656005214055]
[68,106,"Andy James","Tailwind Nutrition","M","M40","04:35:44",100.1605252676427]
[69,25,"Peter Kusy","Milford Haven","M","M","04:36:00",100.06396871567718]
[70,33,"Tom Rees","Newport,Pembs","M","M","04:38:20",99.219098885978781]
[71,145,"Bev Tucker","Mynydd Du","F","F50","04:40:43",98.356124702786857]
[72,72,"Timothy Parker","Mercia Fell Runners","M","M50","04:42:19",97.776785390993709]
[73,130,"Matt Rogerson","Llanelli","M","M40","04:43:55",97.197446079200517]
[74,36,"Jonny Sable","Rhedwyr Preseli","M","M","04:44:28",96.998298190771621]
[75,30,"Tim Plumb","Narberth","M","M","04:44:43",96.907776423303929]
[76,5,"Michael Brown","London","M","M","04:44:44",96.901741638806101]
[77,139,"Kim Braznell","Mercia Fell Runners","F","F60","04:44:54",96.841393793827635]
[78,96,"Claudio Donofrio","Swansea","M","M40","04:46:33",96.243950128540916]
[79,120,"Gareth Oliver","Swansea","M","M40","04:47:26",95.924106550155088]
[80,18,"Ricky Holmes","Aberporth","M","M","04:47:35",95.869793489674478]
[81,117,"Fraser Mcmillan","Cardigan Rc","M","M40","04:49:37",95.133549780937329]
[82,166,"Jethro Moore","Adventure Beyond","M","M","04:50:23",94.85594969403644]
[83,82,"Theo Akritidis","Reading","M","M40","04:50:24",94.849914909538583]
[85,162,"Sue Howard","Mercis Fell Runners","F","F50","04:53:23",93.769688484424236]
[86,22,"Trys Johns","Cardigan Rc","M","M","04:54:23",93.407601414553483]
[87,150,"Helen Duffield","Sedbury","F","F40","04:55:20",93.063618698176299]
[88,78,"David Sheard","Bridgend","M","M50","04:55:51",92.876540378743087]
[89,13,"Robert Gale","Newport Gwent","M","M","04:56:28",92.653253352322821]
[90,8,"George Colville","Blaggers Tri","M","M","04:57:38",92.230818437473602]
[91,109,"Simeon Jenkins","Blaggers Tri","M","M40","04:57:39",92.224783652975745]
[92,84,"Steven Badger","Swansea Choc Tea Pot!","M","M40","04:59:59",91.379913823277391]
[93,113,"Gary Lewis","Presteigne Pacers","M","M40","05:00:25",91.223009426333391]
[94,144,"Rita Tomkins","Presteigne Pacers","F","F50","05:00:26",91.216974641835534]
[95,116,"David Mackie","Corsham,Wilts","M","M40","05:00:41",91.126452874367843]
[96,46,"Luisa Fogarty","Northumberland","F","F","05:00:49",91.078174598385104]
[97,123,"Justin Pocknell","Ddmt/Caerleon Rc","M","M40","05:01:54",90.685913606025139]
[98,6,"Rob Bruford","Warrington","M","M","05:03:41",90.040191664755653]
[99,68,"Laurie Hughes","Swansea","M","M50","05:04:32",89.732417655365524]
[100,153,"Marcelle Mackay","Hirwaun","F","F40","05:04:44",89.660000241391373]
[101,151,"Sasha Habgood","MDC","F","F40","05:05:30",89.382400154490483]
[102,168,"Gary Gunner","Croft Ambrey Runners","M","M70","05:06:42",88.947895670645607]
[103,93,"Gareth Davies","Broughton","M","M40","05:06:55",88.8694434721736]
[104,53,"Alwyn Oliver","Eryri Harriers","M","M70","05:03:04",90.263478691175948]
[105,11,"Dan Eade","Leukaemia Care","M","M","05:09:00",88.11509540994291]
[106,43,"Fiona Cooper","Newport,Pembs","F","F","05:10:51",87.445234330682055]
[107,42,"Giulia Basevi","Rhedwyr Preseli","F","F","05:13:41",86.419320966048303]
[108,161,"Jane Ward","Dorset Doddlers","F","F40","05:20:45",83.860572338961788]
[109,16,"Alex Harries","Cardiff","M","M","05:20:48",83.842467985468261]
[110,74,"Carl Platel","Fit For Life","M","M50","05:21:09",83.715737511013486]
[111,112,"Geraint Jones","Trefin","M","M40","05:21:48",83.480380915597507]
[112,59,"Ifor Thomas","Solva Slouchers","M","M60","05:22:21",83.281233027168611]
[113,132,"Lee Skone","Crap Tri","M","M40","05:23:20",82.925180741795714]
[114,111,"Dan Jones","Solva","M","M40","05:25:23",82.182902248560708]
[115,142,"Sue Lloyd","Pembrokeshire Harriers","F","F50","05:27:59",81.241475866896806]
[116,156,"Sj Restall","Ddmt","F","F40","05:30:55",80.179353795275986]
[117,3,"Marc Beasley","Rhedwyr Preseli","M","M","05:32:06",79.750884095928939]
[118,108,"Mark Jemmett","Sully,Vog","M","M40","05:32:09",79.732779742435397]
[119,44,"Llinos Davies","Ystalyfera","F","F","05:34:28",78.893944697234872]
[120,57,"Roger Nosworthy","Off-Roadents","M","M60","05:38:17",77.511979047228223]
[121,140,"Bridget Funnell","Off-Roadents","F","F60","05:38:12",77.542152969717478]
[122,122,"Jason Pittaway","Bristol","M","M40","05:39:04",77.228344175829463]
[123,103,"Imtiaz Ilahi","Birmingham","M","M40","05:39:28",77.08350934788119]
[124,148,"Zoe Clancy","Cowbridge","F","F40","05:44:31",75.254969645033995]
[125,134,"Matt Thomas","Cardiff","M","M40","05:50:00",73.2695255452428]
[126,77,"Christopher Sexton","Pembrokeshire Harriers","M","M50","05:56:42",70.843542177108858]
[127,40,"Dave Wilson","Kilgetty","M","M","05:58:47",70.089194114878168]
[128,119,"Robert Nelson","Monmouth","M","M40","05:59:05",69.980567993916935]
[129,159,"Alison Thomas","Machynys","F","F40","06:07:26",66.957140960496304]
[130,138,"John Addams Williams","Mepal/Cambs","M","M40","06:07:26",66.957140960496304]
[131,1,"Leigh Ally","Walsall","M","M","06:07:52",{"$f":"(2-(G131/L$10))*100","v":66.800236563552346}]
[132,118,"Darren Mutter","Narberth","M","M40","06:15:27",64.054409617032576]
[133,51,"Ellen Wakelam","Tresaith","F","F","06:17:27",63.330235477291112]
[134,63,"Robert Ivor Chapman","Pontcanna, Cardiff","M","M50","06:17:27",63.330235477291112]
[135,24,"Alex Jungmayr","Tresaith","M","M","06:16:27",63.692322547161837]
[136,70,"Paul Johnson","Begelly","M","M50","06:20:02",62.394843880125059]

{"sheet":"Cwmdu","index":4,"n_rows":62,"n_cols":12,"rows_kept":62,"cut":false,"hidden":false,"merged":[]}
["Position","Number","Name","Club","Gender","Category","Time","Points"]
[1,235,"Robin Wood","Builth & District","M","M40","01:23:41",{"$f":"(2-(G2/L$10))*100","v":120.42537005927288}]
[2,242,"Samuel Gregory","MDC","M","M","01:23:43",{"$f":"(2-(G3/L$10))*100","v":120.39367333354463},null,"Number of runners","Position","Time (hr.min.sec)"]
[3,207,"Jez Brown","Buckley Runners","M","M40","01:24:43",119.44277156169767,null,{"$f":"COUNT(B2:B201)","v":57},{"$f":"K6+2","v":31},{"$f":"VLOOKUP(K4,A$2:G$201,7,FALSE)","v":"01:46:14"}]
[4,225,"Mark Palmer","Unattached","M","M50","01:26:11",118.04811562965544,null,"Was it an even field?",{"$f":"K6+1","v":30},{"$f":"VLOOKUP(K5,A$2:G$201,7,FALSE)","v":"01:46:00"}]
[5,220,"Nathan Brickman","Belper Harriers","M","M","01:27:22",116.9228818663032,null,{"$f":"ISEVEN(J4)","v":false},{"$f":"IF(J6 = TRUE,(J4/2),((J4+1)/2))","v":29},"01:45:56"]
[6,209,"Iwan Morton","Mynydd Du","M","M40","01:29:44",114.67241433959872,null,null,{"$f":"K6-1","v":28},"01:44:14"]
[7,236,"Mark Lunt","Westbury Harriers","M","M","01:32:23",112.15252464420425,null,null,{"$f":"K6-2","v":27},{"$f":"VLOOKUP(K8,A$2:G$201,7,FALSE)","v":"01:43:25"}]
[8,206,"Niki Radnedge","Unattached","M","M40","01:33:14",111.34425813813434,null,null,{"$f":"IF(J5 = TRUE, K6-3, \" \")","v":" "},{"$f":"VLOOKUP(K9,A7:G206,7,FALSE)","v":{"$error":"#N/A"}}]
[9,251,"Daniel Lewis","Wye Valley Runners","M","M40","01:33:25",111.16992614662907,null,null,null,{"$f":"IF(J6=TRUE,AVERAGE(L4:L9),AVERAGE(L4:L8))","v":"01:45:09.800"}]
[10,238,"Gavin Brace","Lliswerry Runners","M","M","01:33:50",110.77371707502617]
[11,212,"Andy Pritchard","Buckley Runners","M","M40","01:34:01",110.59938508352087]
[12,230,"Anthony Powell","Maldwyn Harriers","M","M40","01:34:44",109.91790548036388]
[13,214,"Patrick Tudor","Unattached","M","M","01:35:00",109.66433167453802]
[14,205,"Dave Robson","Ilkley Harriers","M","M40","01:35:33",109.1413357000222]
[15,246,"Helen Brown","Mynydd Du","F","F40","01:36:06",108.61833972550636]
[16,227,"Mark Nelson","Unattached","M","M40","01:36:21",108.3806142825446]
[17,210,"Hayley Evans","Buckley Runners","F","F","01:36:29",108.25382737963167]
[18,232,"Mike Johnson","Unattached","M","M50","01:36:47",107.9685568480776]
[19,241,"Matthew Lawson","Chepstow Harriers","M","M40","01:37:04",107.69913467938761]
[20,257,"Ben Jozefiak","Eryri Harriers","M","M","01:37:23",107.39801578496939]
[21,219,"John Aggleton","MDC","M","M60","01:38:17",106.54220419030716]
[22,237,"Alex Banks","Bristol & West Ac","M","M","01:39:38",105.25848679831373]
[23,221,"James Woodier","Mynydd Du","M","M","01:41:11",103.78458905195096]
[24,229,"Michael Cope","Mynydd Du","M","M40","01:41:15",103.72119560049447]
[25,250,"Crispin Flower","Mynydd Du","M","M40","01:41:20",103.64195378617387]
[26,218,"Rhian Probert","Mynydd Du","F","F40","01:42:06",102.91292909442456]
[27,244,"Nick Dallimore","MDC","M","M60","01:43:25",101.66090842815937]
[28,231,"Emma Mcwilliams","Mynydd Du","F","F","01:44:14",100.88433864781767]
[29,203,"David Mullin","Mercia Fell Runners","M","M40","01:45:56",99.267805635677831]
[30,226,"Richard Hudson","Avon Valley Runners","M","M50","01:46:00",99.204412184221354]
[31,255,"Peter Dyer","Avon Valley Runners","M","MU23","01:46:14",98.982535104123741]
[32,253,"Dave Place","Unattached","M","M50","01:46:19",98.903293289803159]
[33,201,"Helen Marshall","Aberdare","F","F","01:46:36",98.633871121113174]
[34,204,"Kevin Hagley","SWRR","M","M50","01:46:42",98.538780943928501]
[35,259,"Alice Bedwell","MDC","F","F50","01:46:47",98.459539129607919]
[36,202,"Peter Sowerby","Brecon Ac","M","M50","01:47:27",97.825604615043261]
[37,258,"Mal Evans","Unattached","M","M50","01:47:29",97.793907889315008]
[38,240,"Andy Stott","MDC","M","M50","01:49:28",95.907952708485197]
[39,248,"Pauol Sajgalik","Tj Drhleny","M","M","01:49:55",95.480046911154076]
[40,217,"Tim Edwards","Unattached","M","M","01:52:03",93.451456464547221]
[41,254,"Andy Horlick","Forest Of Dean Ac","M","M40","01:52:09",93.356366287362505]
[42,223,"Rona Davies","Mynydd Du","F","F50","01:53:15",92.310374338330845]
[43,249,"Naomi Law","Mynydd Du","F","F40","01:53:47",91.803226726679128]
[44,234,"Sasha Habgood","MDC","F","F40","01:57:16",88.49091888807888]
[45,213,"Hugh Morgan-Jones","FRA","M","M50","01:57:50",87.95207455069891]
[46,215,"David York","Tattenhall","M","M50","02:02:38",83.387746045833453]
[47,208,"Gary Gunner","Croft Ambrey","M","M70+","02:02:45",83.27680750578466]
[48,222,"Bev Tucker","Mynydd Du","F","F50","02:02:57",83.086627151415243]
[49,233,"Celia Mills","Unattached","F","F50","02:03:39",82.420995911122375]
[50,216,"Joc Dodd","Chepstow Harriers","F","F60","02:05:19",80.83615962471076]
[51,256,"Marc Recopuille","Unattached","M","M40","02:06:05",80.107134932961415]
[52,252,"John Kerley","As Chamonix","M","M60","02:06:07",80.075438207233191]
[53,245,"Caroline Dallimore","MDC","F","F60","02:08:40",77.650638689023424]
[54,243,"Clare Dallimore","MDC","F","F","02:08:41",77.634790326159305]
[55,239,"Paul Symons","Unattached","M","M50","02:14:13",72.373133855272755]
[56,224,"John Nash","Chepstow Harriers","M","M50","02:24:32",62.562997242384853]
[57,228,"Wendy Sharpe-Nash","Chepstow Harriers","F","F50","02:24:33",62.547148879520755]
[null,null,"",""]
[null,null,"",""]
[null,null,"",""]
[null,null,"",""]

{"sheet":"Pen Y Fan","index":5,"n_rows":97,"n_cols":12,"rows_kept":97,"cut":false,"hidden":false,"merged":[]}
["Position","Number","Name","Club","Gender","Category","Time","Points"]
[1,"Unknown","Michael Corrales","North Wales Road Runners","M","M","00:36:23",{"$f":"(2-(G2/L$10))*100","v":128.29300339428448}]
[{"$f":"A2+1","v":2},"Unknown","Dan Doherty","Mynydd Du","M","M","00:36:32",{"$f":"(2-(G3/L$10))*100","v":127.99737216686742},null,"Number of runners","Position","Time (min.sec)"]
[{"$f":"A3+1","v":3},"Unknown","Samuel Bevan","Basingstoke & Mid Hants AC","M","M","00:37:35",125.92795357494802,null,{"$f":"COUNT(A2:A201)","v":96},{"$f":"K6+2","v":50},{"$f":"VLOOKUP(K4,A2:G201,7,FALSE)","v":"00:51:42"}]
[4,"Unknown","Billy Starling","Mercia Fell Runners","M","M","00:38:35",123.95707872550092,null,{"$f":"ISEVEN(J4)","v":true},{"$f":"K6+1","v":49},{"$f":"VLOOKUP(K5,A3:G202,7,FALSE)","v":"00:50:51"}]
[5,"Unknown","Jez Brown","Buckley Runners","M","M40","00:38:46",123.59575166976899,null,null,{"$f":"IF(J5 = TRUE,(J4/2),((J4+1)/2))","v":48},"00:50:50"]
[6,"Unknown","Jim Webb","Team Bath AC","M","M","00:39:46",121.6248768203219,null,null,{"$f":"K6-1","v":47},"00:50:39"]
[7,"Unknown","Andrew Reeves","Serpentine Running Club","M","M40","00:40:48",119.58830614255996,null,null,{"$f":"K6-2","v":46},"00:50:19"]
[8,"Unknown","David Lawson","MDC","M","M","00:41:56",117.35464797985328,null,null,{"$f":"IF(J5 = TRUE, K6-3, Na)","v":45},"00:50:05"]
[9,"Unknown","Hopcyn Matthews","Unattached","M","M","00:42:14",116.76338552501917,null,null,null,{"$f":"IF(J5=TRUE,AVERAGE(L4:L9),AVERAGE(L4:L8))","v":"00:50:44.333"}]
[10,"Unknown","Christian Poulton","Cambridge Harriers","M","M50","00:42:17",116.66484178254683]
[11,"Unknown","Llewelyn Lloyd","Sarn Helen","M","M","00:42:31",116.20497098434251]
[12,"Unknown","Joe Starling","Mercia Fell Runners","M","M","00:42:34",116.10642724187015]
[13,"Unknown","Mark Hopkinson","Unattached","M","M","00:42:38",115.97503558524033]
[14,"Unknown","Tarbo Fukazawa","Cambridge Harriers","M","M","00:43:00",115.25238147377644]
[15,"Unknown","Daniel Nettelfield","South Molton Strugglers","M","M","00:43:01",115.21953355961898]
[16,"Unknown","Thomas Mollekin","Mynydd Du","M","M","00:43:21",114.56257527646994]
[17,"Unknown","Mark Lunt","Westbury Harriers","M","M","00:43:32",114.20124822073801]
[18,"Unknown","Nick Biggs","Vegan Runners","M","M40","00:43:55",113.44574619511663]
[19,"Unknown","Anthony Powell","Maldwyn Harriers","M","M40","00:44:06",113.08441913938468]
[20,"Unknown","Mark Bevan","Basingstoke & Mid Hants AC","M","M50","00:45:05",111.14639220409505]
[21,"Unknown","Helen Brown","Mynydd Du","F","F40","00:45:16",110.7850651483631]
[22,"Unknown","Andrew Pritchard","Buckley Runners","M","M40","00:45:18",110.7193693200482]
[23,"Unknown","Edward Davies","Mercia Fell Runners","M","M60","00:45:36",110.12810686521406]
[24,"Unknown","James Gillanders","Serpentine Running Club","M","M","00:45:38",110.06241103689915]
[25,"Unknown","John Keenan","London Frontrunners","M","M40","00:45:42",109.93101938026936]
[26,"Unknown","Jonny Ashley","Unattached","M","M","00:45:55",109.50399649622251]
[27,"Unknown","Malcolm O'Brien","Unattached","M","M","00:46:24",108.55140698565644]
[28,"Unknown","Evan Davies","Unattached","M","M","00:46:24",108.55140698565644]
[29,"Unknown","John Aggleton","MDC","M","M60","00:46:47",107.79590496003505]
[30,"Unknown","Jonathan Moscrop","Serpentine Running Club","M","M40","00:47:03",107.27033833351585]
[31,"Unknown","Anderson Hirst","Unattached","M","M50","00:47:04",107.23749041935839]
[32,"Unknown","Nigel Eldridge","Ryde Harriers","M","M40","00:47:04",107.23749041935839]
[33,"Unknown","Paul Dodd","Chepstow Harriers","M","M50","00:47:06",107.17179459104349]
[34,"Unknown","Gemma Moore","North Wales Road Runners","F","F","00:47:07",107.13894667688604]
[35,"Unknown","Hayley Evans","Buckley Runners","F","F","00:47:22",106.64622796452426]
[36,"Unknown","Helen Marshall","Aberystwyth AC","F","F","00:48:10",105.06952808496663]
[37,"Unknown","Rodney Parker","Ryde Harriers","M","M40","00:48:19",104.77389685754954]
[38,"Unknown","Harry Rann","Godshill Massive","M","M","00:48:33",104.31402605934525]
[39,"Unknown","Richard Love","Mercia Fell Runners","M","M50","00:48:50",103.75561151866857]
[40,"Unknown","Kevin Hagley","South West Road Runners","M","M50","00:48:54",103.62421986203879]
[41,"Unknown","Paul Tucker","Mynydd Du","M","M50","00:48:59",103.45998029125153]
[42,"Unknown","Rhian Probert","Mynydd Du","F","F40","00:49:08",103.16434906383445]
[43,"Unknown","Gary Pearson","Croft Ambrey","M","M40","00:49:47",101.8832804116939]
[44,"Unknown","Dave Clarke","Unattached","M","M","00:49:53",101.68619292674919]
[45,"Unknown","Clem Dixon","Cambridge Harriers","M","M50","00:50:05",101.29201795685975]
[46,"Unknown","Martin Green","Maldwyn Harriers","M","M60","00:50:19",100.83214715865543]
[47,"Unknown","Julian Boon","Forest of Dean AC","M","M40","00:50:39",100.17518887550642]
[48,"Unknown","Jonathan Smith","Ranelagh Harriers","M","M","00:50:50",99.813861819774473]
[49,"Unknown","Andrew Noble","Folkestone RC","M","M50","00:50:51",99.781013905617002]
[50,"Unknown","Paul Kelly","Durham Fell Runners","M","M60","00:51:42",98.105770283587006]
[51,"Unknown","Simon Blease","Brycheiniog","M","M50","00:52:19",96.890397459761317]
[52,"Unknown","Rona Davies","Mynydd Du","F","F50","00:52:41",96.167743348297407]
[53,"Unknown","Julian Williams","London Frontrunners","M","M40","00:52:42",96.134895434139935]
[54,"Unknown","James Morrison","Tiverton Harriers","M","M40","00:53:09",95.248001751888765]
[55,"Unknown","David Place","Unattached","M","M50","00:53:32",94.492499726267411]
[56,"Unknown","Ged Murphy","Unattached","M","M40","00:54:07",93.342822730756609]
[57,"Unknown","Trevor McAlister","Ryde Harriers","M","M","00:54:24",92.784408190079944]
[58,"Unknown","Richard Quinn","Unattached","M","M","00:54:50",91.930362421986217]
[59,"Unknown","Alan Stanley","Unattached","M","M50","00:55:01",91.569035366254241]
[60,"Unknown","Sasha Habgood","MDC","F","F40","00:55:18",91.010620825577575]
[61,"Unknown","Natalie Taylor","Mynydd Du","F","F","00:55:34",90.485054199058339]
[62,"Unknown","Chris Hall","Stubbington Green Runners","M","M50","00:55:45",90.12372714332642]
[63,"Unknown","John Morris","Buckley Runners","M","M70","00:56:15",89.138289718602891]
[64,"Unknown","James Relph","London Frontrunners","M","M","00:56:38",88.382787692981509]
[65,"Unknown","Sarah Pemberton","Serpentine Running Club","F","F","00:56:44",88.185700208036792]
[66,"Unknown","Sophie Smith","Bournville Harriers","F","F","00:56:46",{"$f":"(2-(G67/L$10))*100","v":88.120004379721919}]
[{"$f":"A67+1","v":67},"Unknown","Ian Morgan","Forest of Dean AC","M","M","00:57:16",87.134566954998377]
[68,"Unknown","Graham Maynard","Cambridge Harriers","M","M50","00:57:29",86.707544070951514]
[69,"Unknown","Matthew Mason","Ely Runners","M","M40","00:58:11",85.327931676338579]
[70,"Unknown","Nick Ashley","Unattached","M","M50","00:58:53",83.948319281725631]
[71,"Unknown","Ian Marshall","Cambridge Harriers","M","M60","00:58:55",83.88262345341073]
[72,"Unknown","Peter McDonald","Unattached","M","M","00:59:19",83.094273513631876]
[73,"Unknown","John Jaspers","Hay Hotfooters","M","M40","00:59:25",82.897186028687202]
[74,"Unknown","Daniel Seymour","Unattached","M","M","01:00:13",81.32048614912955]
[75,"Unknown","David York","Tattenhall Runners","M","M50","01:00:53",80.006569582831503]
[76,"Unknown","Neil Williams","Mynydd Du","M","M","01:00:01",81.714661119018956]
[77,"Unknown","John Price","Hay Hotfooters","M","M60","01:00:04",81.616117376546612]
[78,"Unknown","Gary Gunner","Croft Ambrey","M","M70","01:00:05",81.58326946238914]
[79,"Unknown","Anthony Howells","Unattached","M","M50","01:01:09",79.481002956312309]
[80,"Unknown","Anna Lawson","Unattached","F","F","01:01:17",79.218219643052691]
[81,"Unknown","Andrew Law","Plumstead Runners","M","M40","01:01:18",79.185371728895234]
[82,"Unknown","Karlwinder Hayer","London Frontrunners","M","M40","01:01:41",78.42986970327388]
[83,"Unknown","William Gold","Unattached","M","M","01:02:46",76.294755283039535]
[84,"Unknown","Les Williams","Eryri","M","M70","01:03:07",75.604949085733097]
[85,"Unknown","Joc Dodd","Chepstow Harriers","F","F60","01:04:47",72.320157669987978]
[86,"Unknown","Badar Al Raisi","London Frontrunners","M","M","01:05:01",71.860286871783657]
[87,"Unknown","Tom Davies","Croft Ambrey","M","M60","01:05:42",70.513522391328181]
[88,"Unknown","Tosh Simpkin","Unattached","M","M40","01:05:46",70.382130734698364]
[89,"Unknown","Ellie Salisbury","Eryri","F","F50","01:05:53",70.152195335596204]
[90,"Unknown","Sean McNally","Unattached","M","M","01:05:58",69.987955764808959]
[91,"Unknown","Adrian Moir","MDC","M","M50","01:06:54",68.148472571991704]
[92,"Unknown","Andrew Leah","Ryde Harriers","M","M50","01:07:10",67.622905945472468]
[93,"Unknown","Tim Peachey","Unattached","M","M50","01:10:58",60.133581517573667]
[94,"Unknown","Margaret Oliver","Eryri","F","F60","01:12:46",56.586006788568952]
[95,"Unknown","Claire Campbell","Glossopdale Harriers","F","F40","01:14:27",53.268367458666411]
[96,"Unknown","Rosie Eldridge","Ryde Harriers","F","F","01:14:29",53.202671630351503]

{"sheet":"Fan Brycheiniog","index":6,"n_rows":39,"n_cols":12,"rows_kept":39,"cut":false,"hidden":false,"merged":[]}
["Position","Number","Name","Club","Gender","Category","Time","Points"]
[1,349,"Dan Doherty","Mynydd Du","M","M","01:15:38.790",{"$f":"(2-(G2/L$10))*100","v":127.71704668244541}]
[{"$f":"A2+1","v":2},315,"Tom Mollekin","Mynydd Du","M","M","01:27:41.120",{"$f":"(2-(G3/L$10))*100","v":116.21350814687332},null,"Number of runners","Position","Time (min.sec)"]
[{"$f":"A3+1","v":3},314,"Alun Wood","Mynydd Du","M","M","01:30:27.780",113.55934767681333,null,{"$f":"COUNT(A2:A201)","v":38},{"$f":"K6+2","v":21},{"$f":"VLOOKUP(K4,A2:G201,7,FALSE)","v":"01:45:52.720"}]
[4,334,"Jez Brown","Buckley Runners","M","M40","01:31:49.400",112.25950021751716,null,{"$f":"ISEVEN(J4)","v":true},{"$f":"K6+1","v":20},"01:45:19.040"]
[5,346,"Alex Lewis","Neath Harriers","M","M","01:32:58.400",111.16063382825676,null,null,{"$f":"IF(J5 = TRUE,(J4/2),((J4+1)/2))","v":19},"01:44:21.260"]
[6,343,"Matthew Lawson","Chepstow Harriers","M","M40","01:36:04.710",108.1935353212552,null,null,{"$f":"K6-1","v":18},"01:44:18.590"]
[7,332,"Andy Creber","Chepstow Harriers","M","M50","01:36:21.590",107.92471119588249,null,null,{"$f":"K6-2","v":17},"01:44:10.980"]
[8,327,"Andy Pritchard","Buckley Runners","M","M40","01:36:28.200",107.8194429809113,null,null,{"$f":"IF(J5 = TRUE, K6-3, Na)","v":16},"01:43:52.600"]
[9,326,"Hayley Evans","Buckley Runners","F","F","01:36:33.910",107.72850780580005,null,null,null,{"$f":"IF(J5=TRUE,AVERAGE(L4:L9),AVERAGE(L4:L8))","v":"01:44:39.198"}]
[10,324,"Andy Vaudin","Unattached","M","M50","01:36:43.480",107.57609981528961]
[11,318,"Andy Horlick","Forest Of Dean Ac","M","M40","01:36:50.590",107.46286880039624]
[12,325,"Niki Morgan","Mynydd Du","F","F50","01:38:50.990",105.54542657913603]
[13,329,"Nick Dallimore","MDC","M","M60","01:39:24.160",105.01717443229883]
[14,330,"Rhian Probert","Mynydd Du","F","F40","01:39:49.440",104.61457526823357]
[15,333,"Pauline Linton","FRA","F","F50","01:43:21.530",101.23691479724455]
[16,313,"James Woodier","Mynydd Du","M","M","01:43:52.600",100.7421064100805]
[17,322,"Martin Carter","Hay Hotfooters","M","M50","01:44:10.980",100.44939388494126]
[18,344,"Sasha Habgood","MDC","F","F40","01:44:18.590",100.32820007012573]
[19,345,"Andy Stott","MDC","M","M50","01:44:21.260",100.28567871854131]
[20,320,"David Mullin","Mercia Fell Runners","M","M40","01:45:19.040",99.365497559534546]
[21,337,"Jon Roberts","Unattached","M","M","01:45:52.720",98.829123356776719]
[22,341,"Andrew Blackmore","MDC","M","M50","01:50:28.270",94.440824319665026]
[23,339,"Martin Scrivens","Unattached","M","M","01:50:55.650",94.004781395926628]
[24,347,"David York","Tattenhall Runners","M","M50","01:54:55.170",90.190281721207]
[25,342,"Rona Davies","Mynydd Du","F","F50","01:56:04.450",89.086956163990166]
[26,340,"Mark Scrivens","Monross Trailblazers","M","M40","01:56:11.420",88.975954733075]
[27,348,"Tim Watkins","Forest Of Dean Ac","M","M","01:57:42.360",87.527680683229491]
[28,350,"Julian Boon","Forest Of Dean Ac","M","M40","02:01:10.510",84.212767075627212]
[29,317,"John Jaspers","Unattached","M","M40","02:04:56.400",80.615333326786171]
[30,335,"Nathanial Swan","Unattached","M","M","02:05:22.580",80.198401122860957]
[31,319,"Karen Elvers","MDC","F","F40","02:07:12.260",78.451681331932235]
[32,328,"Caroline Dallimore","MDC","F","F60","02:07:21.030",78.312013821297285]
[33,338,"Dawn Louise Roberts","Unattached","F","F","02:07:25.890",78.23461540605372]
[34,323,"Gareth Jones","MDC","M","M60","02:09:50.340",75.934162508536801]
[35,331,"Les Williams","Rhenwyr Eryri","M","MV70","02:12:10.890",73.695819450412898]
[36,316,"Paul Symons","Unattached","M","M50","02:12:14.340",73.640876130949849]
[37,321,"John Price","Hay Hotfooters","M","M60","02:18:11.770",67.948588978582464]
[38,336,"Richard Cronin","MDC","M","M","02:18:24.440",67.746811628554511]

{"sheet":"Llyn Y Fan","index":7,"n_rows":90,"n_cols":12,"rows_kept":90,"cut":false,"hidden":false,"merged":[]}
["Position","Number","Name","Club","Sex","Category","Time","Points",{"$f":"AVERAGE(G4:G8)","v":{"$error":"#DIV/0!"}}]
[1]
[{"$f":"A2+1","v":2},null,null,null,null,null,null,null,null,"Number of runners","Position","Time (min.sec)"]
[{"$f":"A3+1","v":3},null,null,null,null,null,null,null,null,{"$f":"COUNT(B2:B201)","v":0},{"$f":"K6+2","v":2},{"$f":"VLOOKUP(K4,A2:G201,7,FALSE)","v":"00:00:00"}]
[4,null,null,null,null,null,null,null,null,{"$f":"ISEVEN(J4)","v":true},{"$f":"K6+1","v":1},{"$error":"#N/A"}]
[5,null,null,null,null,null,null,null,null,null,{"$f":"IF(J5 = TRUE,(J4/2),((J4+1)/2))","v":0},{"$error":"#N/A"}]
[6,null,null,null,null,null,null,null,null,null,{"$f":"K6-1","v":-1},{"$error":"#N/A"}]
[7,null,null,null,null,null,null,null,null,null,{"$f":"K6-2","v":-2},{"$error":"#N/A"}]
[8,null,null,null,null,null,null,null,null,null,{"$f":"IF(J5 = TRUE, K6-3, Na)","v":-3},{"$error":"#N/A"}]
[9,null,null,null,null,null,null,null,null,null,null,{"$f":"IF(J5=TRUE,AVERAGE(L4:L9),AVERAGE(L4:L8))","v":{"$error":"#N/A"}}]
[10]
[11]
[12]
[13]
[14]
[15]
[16]
[17]
[18]
[19]
[20]
[21]
[22]
[23]
[24]
[25]
[26]
[27]
[28]
[29]
[30]
[31]
[32]
[33]
[34]
[35]
[36]
[37]
[38]
[39]
[40]
[41]
[42]
[43]
[44]
[45]
[46]
[47]
[48]
[49]
[50]
[51]
[52]
[53]
[54]
[55]
[56]
[57]
[58]
[59]
[60]
[61]
[62]
[63]
[64]
[65]
[66]
[{"$f":"A67+1","v":67}]
[68]
[69]
[70]
[71]
[72]
[73]
[74]
[75]
[76]
[77]
[78]
[79]
[80]
[81]
[82]
[83]
[84]
[85]
[86]
[87]
[88]
[89]