{"text_format":"1","workbook":"xlsx","n_sheets":8,"sheets":["Series Winners","Series Table","Torpantau","Preseli Beast","Cwmdu","Pen Y Fan","Fan Brycheiniog","Llyn Y Fan"],"not_rendered":{"charts":0,"images":1,"macros":1,"external_links":1,"defined_names":59,"comments":0,"pivot_tables":0},"unopened":[],"bounds":{"document_bytes":16777216,"sheet_cells":100000,"rows_first":2000,"rows_last":500,"rows_between":2000,"halvings":0,"cell_chars":16384,"cell_head_chars":4096},"cells_cut":0,"cells_raw":0,"read":"whole","date_system":"1900"}

{"sheet":"Series Winners","index":0,"n_rows":23,"n_cols":6,"rows_kept":23,"cut":false,"hidden":false,"merged":[]}
[]
[null,"MU40",null,null,null,"FU40"]
[]
[null,"Name","Club","Point","Races completed","Name"]
[]
[]
[]
[]
[null,"MO40",null,null,null,"FO40"]
[]
[]
[]
[]
[]
[null,"M050"]
[]
[]
[]
[null,"MO60"]
[]
{"$rows_left_out":4}
{"sheet":"Series Table","index":1,"n_rows":297,"n_cols":22,"rows_kept":297,"cut":false,"hidden":false,"merged":[[0,16,0,17],[0,6,0,7],[0,8,0,9],[0,10,0,11],[0,12,0,13],[0,14,0,15]]}
[null,"2017 Summer Series",null,null,null,null,"Torpantau",null,"Preseli Beast",null,"Cwmdu",null,"Pen Y Fan",null,"Fan Brycheiniog",null,"Llyn Y Fan "]
["Pos","Name","Club","Gender","Cat.","Total","Time","Score","Time","Score","Time","Score","Time","Score","Time","Score","Time","Score","Competed","Ave (Best of 4)",null,"WFRA membership as of March 2017"]
[{"$f":"ROW(A1)","v":1},"Dan Doherty",{"$f":"IFERROR(VLOOKUP(B3,INDIRECT(\"'\"&$M$1&\"'!\"&\"$C$2:$H$200\"),2,FALSE),\"\")","v":"Mynydd Du"},{"$f":"IFERROR(VLOOKUP(B3,INDIRECT(\"'\"&$M$1&\"'!\"&\"$C$2:$H$200\"),3,FALSE),\"\")","v":"M"},{"$f":"IFERROR(VLOOKUP(B3,INDIRECT(\"'\"&$M$1&\"'!\"&\"$C$2:$H$200\"),4,FALSE),\"\")","v":"M"},{"$f":"SUM(LARGE((H3,J3,L3,N3,P3,R3),{1,2,3,4}))","v":517.00595597322217},{"$f":"IFERROR(VLOOKUP(B3,INDIRECT(\"'\"&$G$1&\"'!\"&\"$C$2:$H$200\"),5,FALSE),\"\")","v":"01:03:35"},{"$f":"IFERROR(VLOOKUP(B3,INDIRECT(\"'\"&$G$1&\"'!\"&\"$C$2:$H$200\"),6,FALSE),0)","v":128.48886250741981},{"$f":"IFERROR(VLOOKUP(B3,INDIRECT(\"'\"&$I$1&\"'!\"&\"$C$2:$G$200\"),5,FALSE),\"\")","v":0.12887731481481482},{"$f":"IFERROR(VLOOKUP(B3,INDIRECT(\"'\"&$I$1&\"'!\"&\"$C$2:$H$200\"),6,FALSE),0)","v":132.80267461648944},{"$f":"IFERROR(VLOOKUP(B3,INDIRECT(\"'\"&$K$1&\"'!\"&\"$C$2:$H$200\"),5,FALSE),\"\")","v":""},{"$f":"IFERROR(VLOOKUP(B3,INDIRECT(\"'\"&$K$1&\"'!\"&\"$C$2:$H$200\"),6,FALSE),0)","v":0},{"$f":"IFERROR(VLOOKUP(B3,INDIRECT(\"'\"&$M$1&\"'!\"&\"$C$2:$h$200\"),5,FALSE),\"\")","v":2.5370370370370366E-2},{"$f":"IFERROR(VLOOKUP(B3,INDIRECT(\"'\"&$M$1&\"'!\"&\"$C$2:$h$200\"),6,FALSE),0)","v":127.99737216686742},{"$f":"IFERROR(VLOOKUP(B3,INDIRECT(\"'\"&$O$1&\"'!\"&\"$C$2:$h$200\"),5,FALSE),\"\")","v":5.2532291666666668E-2},{"$f":"IFERROR(VLOOKUP(B3,INDIRECT(\"'\"&$O$1&\"'!\"&\"$C$2:$h$200\"),6,FALSE),0)","v":127.71704668244541},{"$f":"IFERROR(VLOOKUP(B3,INDIRECT(\"'\"&$Q$1&\"'!\"&\"$C$2:$h$200\"),5,FALSE),\"\")","v":""},{"$f":"IFERROR(VLOOKUP(B3,INDIRECT(\"'\"&$Q$1&\"'!\"&\"$C$2:$h$200\"),6,FALSE),0)","v":0},{"$f":"6-COUNTIF(G3:Q3,\"\")","v":4},{"$f":"F3/IF(S3>4,4,S3)","v":129.25148899330554},null,{"$f":"COUNTIF(#REF!,'Series Table'!B3)>0","v":{"$error":"#REF!"}}]
[{"$f":"ROW(A2)","v":2},"Jez Brown",{"$f":"IFERROR(VLOOKUP(B4,INDIRECT(\"'\"&$M$1&\"'!\"&\"$C$2:$H$200\"),2,FALSE),\"\")","v":"Buckley Runners"},{"$f":"IFERROR(VLOOKUP(B4,INDIRECT(\"'\"&$M$1&\"'!\"&\"$C$2:$H$200\"),3,FALSE),\"\")","v":"M"},{"$f":"IFERROR(VLOOKUP(B4,INDIRECT(\"'\"&$M$1&\"'!\"&\"$C$2:$H$200\"),4,FALSE),\"\")","v":"M40"},{"$f":"SUM(LARGE((H4,J4,L4,N4,P4,R4),{1,2,3,4}))","v":487.87741103905296},"",0,0.12930555555555556,132.57938759006916,"01:24:43",119.44277156169767,2.6921296296296294E-2,123.59575166976899,6.3766203703703714E-2,112.25950021751716,"",0,4,121.96935275976324,null,{"$f":"COUNTIF(#REF!,'Series Table'!B4)>0","v":{"$error":"#REF!"}}]
[3,"Andy Pritchard",{"$f":"IFERROR(VLOOKUP(B5,INDIRECT(\"'\"&$G$1&\"'!\"&\"$C$2:$H$200\"),2,FALSE),\"\")","v":"Buckley Runners"},{"$f":"IFERROR(VLOOKUP(B5,INDIRECT(\"'\"&$G$1&\"'!\"&\"$C$2:$H$200\"),3,FALSE),\"\")","v":"M"},{"$f":"IFERROR(VLOOKUP(B5,INDIRECT(\"'\"&$G$1&\"'!\"&\"$C$2:$H$200\"),4,FALSE),\"\")","v":"M40"},{"$f":"SUM(LARGE((H5,J5,L5,N5,P5,R5),{1,2,3,4}))","v":438.67122208440742},"01:20:18",109.6879002780468,0.17152777777777775,110.56449374192849,"01:34:01",110.59938508352087,"",0,6.6993055555555556E-2,107.8194429809113,"",0,4,109.66780552110185,null,{"$f":"COUNTIF(#REF!,'Series Table'!B5)>0","v":{"$error":"#REF!"}}]
[4,"Hayley Evans",{"$f":"IFERROR(VLOOKUP(B6,INDIRECT(\"'\"&$M$1&\"'!\"&\"$C$2:$H$200\"),2,FALSE),\"\")","v":"Buckley Runners"},{"$f":"IFERROR(VLOOKUP(B6,INDIRECT(\"'\"&$M$1&\"'!\"&\"$C$2:$H$200\"),3,FALSE),\"\")","v":"F"},{"$f":"IFERROR(VLOOKUP(B6,INDIRECT(\"'\"&$M$1&\"'!\"&\"$C$2:$H$200\"),4,FALSE),\"\")","v":"F"},{"$f":"SUM(LARGE((H6,J6,L6,N6,P6,R6),{1,2,3,4}))","v":438.55514831999699},"01:22:44",106.95116998344218,0.1618287037037037,115.6216431511231,"01:36:29",108.25382737963167,3.2893518518518523E-2,106.64622796452426,6.7059143518518521E-2,107.72850780580005,"",0,5,109.63878707999925,null,{"$f":"COUNTIF(#REF!,'Series Table'!B6)>0","v":{"$error":"#REF!"}}]
[5,"Rhian Probert","Mynydd Du","F","F40",{"$f":"SUM(LARGE((H7,J7,L7,N7,P7,R7),{1,2,3,4}))","v":414.38876240987281},"",0,0.18469907407407407,103.69690898338023,"01:42:06",102.91292909442456,3.412037037037037E-2,103.16434906383445,6.9322222222222216E-2,104.61457526823357,"",0,4,103.5971906024682,null,{"$f":"COUNTIF(#REF!,'Series Table'!B7)>0","v":{"$error":"#REF!"}}]
[6,"Rona Davies","Mynydd Du","F","F50",{"$f":"SUM(LARGE((H8,J8,L8,N8,P8,R8),{1,2,3,4}))","v":388.68404729351812},"01:30:10",98.591021275266357,0.18869212962962964,101.61490833162348,"01:53:15",92.310374338330845,3.6585648148148145E-2,96.167743348297407,8.0607060185185181E-2,89.086956163990166,"",0,5,97.17101182337953,null,{"$f":"COUNTIF(#REF!,'Series Table'!B8)>0","v":{"$error":"#REF!"}}]
[7,"Sasha Habgood","MDC","F","F40",{"$f":"SUM(LARGE((H9,J9,L9,N9,P9,R9),{1,2,3,4}))","v":373.35141880707465},"01:35:28",92.630197756880889,0.21215277777777777,89.382400154490483,"01:57:16",88.49091888807888,3.8402777777777779E-2,91.010620825577575,7.243738425925926E-2,100.32820007012573,"",0,5,93.337854701768663,null,{"$f":"COUNTIF(#REF!,'Series Table'!B9)>0","v":{"$error":"#REF!"}}]
[8,"Mark Lunt","Westbury Harriers","M","M",{"$f":"SUM(LARGE((H10,J10,L10,N10,P10,R10),{1,2,3,4}))","v":343.01471197581736},"01:14:06",116.66093911087509,"",0,"01:32:23",112.15252464420425,3.0231481481481481E-2,114.20124822073801,"",0,"",0,3,114.33823732527246,null,{"$f":"COUNTIF(#REF!,'Series Table'!B10)>0","v":{"$error":"#REF!"}}]
[9,"David York","Tattenhall Runners","M","M50",{"$f":"SUM(LARGE((H11,J11,L11,N11,P11,R11),{1,2,3,4}))","v":341.95974184048396},"01:39:15",88.375144490612016,"",0,"02:02:38",83.387746045833453,4.2280092592592598E-2,80.006569582831503,7.9805208333333336E-2,90.190281721207,"",0,4,85.489935460120989,null,{"$f":"COUNTIF(#REF!,'Series Table'!B11)>0","v":{"$error":"#REF!"}}]
[10,"Daniel Lewis",{"$f":"IFERROR(VLOOKUP(B12,INDIRECT(\"'\"&$I$1&\"'!\"&\"$C$2:$H$200\"),2,FALSE),\"\")","v":"Wye Valley Runners"},{"$f":"IFERROR(VLOOKUP(B12,INDIRECT(\"'\"&$I$1&\"'!\"&\"$C$2:$H$200\"),3,FALSE),\"\")","v":"M"},{"$f":"IFERROR(VLOOKUP(B12,INDIRECT(\"'\"&$I$1&\"'!\"&\"$C$2:$H$200\"),4,FALSE),\"\")","v":"M40"},{"$f":"SUM(LARGE((H12,J12,L12,N12,P12,R12),{1,2,3,4}))","v":339.37680650931657},"01:20:17",109.70664500609205,0.15630787037037039,118.50023535659543,"01:33:25",111.16992614662907,"",0,"",0,"",0,3,113.12560216977219,null,{"$f":"COUNTIF(#REF!,'Series Table'!B12)>0","v":{"$error":"#REF!"}}]
[11,"John Aggleton",{"$f":"IFERROR(VLOOKUP(B13,INDIRECT(\"'\"&$M$1&\"'!\"&\"$C$2:$H$200\"),2,FALSE),\"\")","v":"MDC"},{"$f":"IFERROR(VLOOKUP(B13,INDIRECT(\"'\"&$M$1&\"'!\"&\"$C$2:$H$200\"),3,FALSE),\"\")","v":"M"},{"$f":"IFERROR(VLOOKUP(B13,INDIRECT(\"'\"&$M$1&\"'!\"&\"$C$2:$H$200\"),4,FALSE),\"\")","v":"M60"},{"$f":"SUM(LARGE((H13,J13,L13,N13,P13,R13),{1,2,3,4}))","v":327.545838502327},"",0,0.16645833333333335,113.20772935198484,"01:38:17",106.54220419030716,3.2488425925925928E-2,107.79590496003505,"",0,"",0,3,109.18194616744233,null,{"$f":"COUNTIF(#REF!,'Series Table'!B13)>0","v":{"$error":"#REF!"}}]
[12,"Paul Tucker",{"$f":"IFERROR(VLOOKUP(B14,INDIRECT(\"'\"&$M$1&\"'!\"&\"$C$2:$H$200\"),2,FALSE),\"\")","v":"Mynydd Du"},{"$f":"IFERROR(VLOOKUP(B14,INDIRECT(\"'\"&$M$1&\"'!\"&\"$C$2:$H$200\"),3,FALSE),\"\")","v":"M"},{"$f":"IFERROR(VLOOKUP(B14,INDIRECT(\"'\"&$M$1&\"'!\"&\"$C$2:$H$200\"),4,FALSE),\"\")","v":"M50"},{"$f":"SUM(LARGE((H14,J14,L14,N14,P14,R14),{1,2,3,4}))","v":315.50339645510695},"01:21:36",108.22581149051831,0.1844675925925926,103.81760467333712,"",0,3.4016203703703708E-2,103.45998029125153,"",0,"",0,3,105.16779881836898,null,{"$f":"COUNTIF(#REF!,'Series Table'!B14)>0","v":{"$error":"#REF!"}}]
[13,"James Woodier",{"$f":"IFERROR(VLOOKUP(B15,INDIRECT(\"'\"&$G$1&\"'!\"&\"$C$2:$H$200\"),2,FALSE),\"\")","v":"Mynydd Du"},{"$f":"IFERROR(VLOOKUP(B15,INDIRECT(\"'\"&$G$1&\"'!\"&\"$C$2:$H$200\"),3,FALSE),\"\")","v":"M"},{"$f":"IFERROR(VLOOKUP(B15,INDIRECT(\"'\"&$G$1&\"'!\"&\"$C$2:$H$200\"),4,FALSE),\"\")","v":"M"},{"$f":"SUM(LARGE((H15,J15,L15,N15,P15,R15),{1,2,3,4}))","v":306.79168343416433},"01:26:54",102.26498797213286,"",0,"01:41:11",103.78458905195096,"",0,7.2136574074074075E-2,100.7421064100805,"",0,3,102.26389447805478,null,{"$f":"COUNTIF(#REF!,'Series Table'!B15)>0","v":{"$error":"#REF!"}}]
[14,"Emma McWilliams",{"$f":"IFERROR(VLOOKUP(B16,INDIRECT(\"'\"&$I$1&\"'!\"&\"$C$2:$H$200\"),2,FALSE),\"\")","v":"Mynydd Du"},{"$f":"IFERROR(VLOOKUP(B16,INDIRECT(\"'\"&$I$1&\"'!\"&\"$C$2:$H$200\"),3,FALSE),\"\")","v":"F"},{"$f":"IFERROR(VLOOKUP(B16,INDIRECT(\"'\"&$I$1&\"'!\"&\"$C$2:$H$200\"),4,FALSE),\"\")","v":"F"},{"$f":"SUM(LARGE((H16,J16,L16,N16,P16,R16),{1,2,3,4}))","v":301.45099825691551},"01:29:25",99.434534037302001,0.18961805555555555,101.13212557179585,"01:44:14",100.88433864781767,"",0,"",0,"",0,3,100.4836660856385,null,{"$f":"COUNTIF(#REF!,'Series Table'!B16)>0","v":{"$error":"#REF!"}}]
[15,"Bev Tucker",{"$f":"IFERROR(VLOOKUP(B17,INDIRECT(\"'\"&$I$1&\"'!\"&\"$C$2:$H$200\"),2,FALSE),\"\")","v":"Mynydd Du"},{"$f":"IFERROR(VLOOKUP(B17,INDIRECT(\"'\"&$I$1&\"'!\"&\"$C$2:$H$200\"),3,FALSE),\"\")","v":"F"},{"$f":"IFERROR(VLOOKUP(B17,INDIRECT(\"'\"&$I$1&\"'!\"&\"$C$2:$H$200\"),4,FALSE),\"\")","v":"F50"},{"$f":"SUM(LARGE((H17,J17,L17,N17,P17,R17),{1,2,3,4}))","v":266.81873985757619},"01:41:55",85.375988003374076,0.19494212962962965,98.356124702786857,"02:02:57",83.086627151415243,"",0,"",0,"",0,3,88.939579952525392,null,{"$f":"COUNTIF(#REF!,'Series Table'!B17)>0","v":{"$error":"#REF!"}}]
[16,"Gary Gunner",{"$f":"IFERROR(VLOOKUP(B18,INDIRECT(\"'\"&$M$1&\"'!\"&\"$C$2:$H$200\"),2,FALSE),\"\")","v":"Croft Ambrey"},{"$f":"IFERROR(VLOOKUP(B18,INDIRECT(\"'\"&$M$1&\"'!\"&\"$C$2:$H$200\"),3,FALSE),\"\")","v":"M"},{"$f":"IFERROR(VLOOKUP(B18,INDIRECT(\"'\"&$M$1&\"'!\"&\"$C$2:$H$200\"),4,FALSE),\"\")","v":"M70"},{"$f":"SUM(LARGE((H18,J18,L18,N18,P18,R18),{1,2,3,4}))","v":253.80797263881942},"",0,0.2129861111111111,88.947895670645607,"02:02:45",83.27680750578466,4.1724537037037039E-2,81.58326946238914,"",0,"",0,3,84.602657546273136,null,{"$f":"COUNTIF(#REF!,'Series Table'!B18)>0","v":{"$error":"#REF!"}}]
[17,"Samuel Gregory",{"$f":"IFERROR(VLOOKUP(B19,INDIRECT(\"'\"&$I$1&\"'!\"&\"$C$2:$H$200\"),2,FALSE),\"\")","v":"Machen"},{"$f":"IFERROR(VLOOKUP(B19,INDIRECT(\"'\"&$I$1&\"'!\"&\"$C$2:$H$200\"),3,FALSE),\"\")","v":"M"},{"$f":"IFERROR(VLOOKUP(B19,INDIRECT(\"'\"&$I$1&\"'!\"&\"$C$2:$H$200\"),4,FALSE),\"\")","v":"M"},{"$f":"SUM(LARGE((H19,J19,L19,N19,P19,R19),{1,2,3,4}))","v":243.25102309758455},"",0,0.1479513888888889,122.85734976403992,"01:23:43",120.39367333354463,"",0,"",0,"",0,2,121.62551154879228,null,{"$f":"COUNTIF(#REF!,'Series Table'!B19)>0","v":{"$error":"#REF!"}}]
[18,"Joc Dodd",{"$f":"IFERROR(VLOOKUP(B20,INDIRECT(\"'\"&$M$1&\"'!\"&\"$C$2:$H$200\"),2,FALSE),\"\")","v":"Chepstow Harriers"},{"$f":"IFERROR(VLOOKUP(B20,INDIRECT(\"'\"&$M$1&\"'!\"&\"$C$2:$H$200\"),3,FALSE),\"\")","v":"F"},{"$f":"IFERROR(VLOOKUP(B20,INDIRECT(\"'\"&$M$1&\"'!\"&\"$C$2:$H$200\"),4,FALSE),\"\")","v":"F60"},{"$f":"SUM(LARGE((H20,J20,L20,N20,P20,R20),{1,2,3,4}))","v":237.23891906295142},"01:43:04",84.082601768252687,"",0,"02:05:19",80.83615962471076,4.4988425925925925E-2,72.320157669987978,"",0,"",0,3,79.07963968765047,null,{"$f":"COUNTIF(#REF!,'Series Table'!B20)>0","v":{"$error":"#REF!"}}]
{"$rows_left_out":278}
{"sheet":"Torpantau","index":2,"n_rows":90,"n_cols":12,"rows_kept":90,"cut":false,"hidden":false,"merged":[]}
["Position","Number","Name","Club","Gender","Category","Time","Points"]
[1,{"$f":"ROW(A1)","v":1},"Dan Doherty","Mynydd Du","M","M","01:03:35",{"$f":"(2-(G2/L$10))*100","v":128.48886250741981}]
[{"$f":"A2+1","v":2},{"$f":"ROW(A2)","v":2},"Nathan Brickman","Belpher Harriers","M","M","01:14:00",116.77340747914648,null,"Number of runners","Position","Time (min.sec)"]
[{"$f":"A3+1","v":3},3,"Mark Lunt","Westbury Harriers","M","M","01:14:06",116.66093911087509,null,{"$f":"COUNT(B2:B201)","v":44},{"$f":"K6+2","v":24},{"$f":"VLOOKUP(K4,A2:G201,7,FALSE)","v":"01:29:55"}]
[4,4,"Tom Molleskin","Mynydd Du","M","M","01:20:15",109.74413446218252,null,{"$f":"ISEVEN(J4)","v":true},{"$f":"K6+1","v":23},"01:29:25"]
[5,5,"Brad Johnson","U/A","M","M","01:20:16",109.72538973413731,null,null,{"$f":"IF(J5 = TRUE,(J4/2),((J4+1)/2))","v":22},"01:28:57"]
[6,6,"Daniel Lewis","Wye Valley","M","M40","01:20:17",109.70664500609205,null,null,{"$f":"K6-1","v":21},"01:28:48"]
[7,7,"Andy Pritchard","Buckley Runners","M","M40","01:20:18",109.6879002780468,null,null,{"$f":"K6-2","v":20},"01:28:26"]
[8,8,"Karie Atkins","Chepstow","M","M40","01:20:41",109.25677153300634,null,null,{"$f":"IF(J5 = TRUE, K6-3, Na)","v":19},"01:27:58"]
[9,9,"Nick Biggs","Vegan Runners","M","M40","01:20:49",109.10681370864445,null,null,null,{"$f":"IF(J5=TRUE,AVERAGE(L4:L9),AVERAGE(L4:L8))","v":"01:28:54.833"}]
[10,10,"Paul Jeggo","Springfield","M","M50","01:21:16",108.60070605142305]
[11,11,"Paul Tucker","Brecon","M","M50","01:21:36",108.22581149051831]
[12,12,"John Hallett","MDC","M","M","01:21:38",108.18832203442783]
[13,13,"Hayley Evans","Buckley Runners","F","F","01:22:44",106.95116998344218,null,"Retired"]
[14,14,"George Fisher","1 Rifles","M","U23","01:22:44",106.95116998344218,null,"Iwan Murton"]
[15,15,"Ben Arkell","MDC","M","U23","01:26:44",102.45243525258523,null,"Shona Thornhill"]
[16,16,"Paul Chester","Wfra","M","M40","01:26:52",102.30247742822331,null,"Oscar Partridge"]
[17,17,"James Woodier","Mynydd Du","M","M","01:26:54",102.26498797213286]
[18,18,"Chris Chambers","Mynydd Du","M","M40","01:27:53",101.15904901746384]
[19,19,"Max Burns","1 Rifles","M","M","01:27:58",101.06532537723764]
{"$rows_left_out":71}
{"sheet":"Preseli Beast","index":3,"n_rows":136,"n_cols":12,"rows_kept":136,"cut":false,"hidden":false,"merged":[]}
["Position","Number","Name","Club","Gender","Category","Time","Points"]
[1,10,"Dan Doherty","Mynydd Du","M","M","03:05:35",{"$f":"(2-(G2/L$10))*100","v":132.80267461648944}]
[2,85,"Jez Brown","Buckley Runners","M","M40","03:06:12",{"$f":"(2-(G3/L$10))*100","v":132.57938759006916},null,"Number of runners","Position","Time (hr.min.sec)"]
[3,15,"Dylan Griffiths","Rhedwyr Hebog","M","M","03:17:38",128.4395254245471,null,135,{"$f":"K6+2","v":70},{"$f":"VLOOKUP(K4,A2:G201,7,FALSE)","v":"04:38:20"}]
[4,110,"Daryl John","Trots","M","M40","03:24:14",126.04975076340024,null,"Was it an even field?",{"$f":"K6+1","v":69},"04:36:00"]
[5,101,"Daniel Hooper","Cwmdu, Llandeilo","M","M40","03:27:09",124.99366347627725,null,{"$f":"ISEVEN(J4)","v":false},{"$f":"IF(J6 = TRUE,(J4/2),((J4+1)/2))","v":68},"04:35:44"]
[6,164,"Balazs Pinter","Aberystwyth Ac","M","M40","03:32:14",123.15305420443434,null,null,{"$f":"K6-1","v":67},"04:35:43"]
[7,14,"Samuel Gregory","Machen","M","M","03:33:03",122.85734976403992,null,null,{"$f":"K6-2","v":66},"04:35:06"]
[8,91,"Little Dave Cumins","Ddmt/Kom/Ttb","M","M40","03:35:05",122.12110605530277,null,null,{"$f":"IF(J6 = TRUE, K6-3, Na)","v":{"$error":"#NAME?"}},{"$error":"#NAME?"}]
[9,100,"Sam Hawking","Neath","M","M40","03:36:03",121.77108855442773,null,null,null,{"$f":"IF(J6=TRUE,AVERAGE(L4:L9),AVERAGE(L4:L8))","v":"04:36:10.600"}]
[10,20,"Afan Humphries","Caerphilly","M","M","03:42:33",119.41752260026797]
[11,52,"Sian Williams","Rhedwyr Hebog","F","F","03:43:13",119.17613122035414]
[12,115,"Daniel Lewis","Wye Valley Runners","M","M40","03:45:05",118.50023535659543]
[13,69,"Paul Jeggo","Chelmsford","M","M50","03:47:41",117.55880897493152]
[14,47,"Nerys Jones","Parcllyn, Ceredigion","F","F","03:47:58",117.45621763846815]
[15,75,"David Powell","Aberystwyth Ac","M","M50","03:48:05",117.41397414698321]
[16,7,"Dee Buchanan","San Domenico","M","M","03:49:29",116.9070522491642]
[17,163,"Patrick Swann","U/A","M","M40","03:49:34",116.87687832667497]
[18,128,"Simon Roberts","Chester Ac","M","M40","03:52:23",115.85699974653907]
[19,45,"Hayley Evans","Buckley Runners","F","F","03:53:02",115.6216431511231]
{"$rows_left_out":117}
{"sheet":"Cwmdu","index":4,"n_rows":62,"n_cols":12,"rows_kept":62,"cut":false,"hidden":false,"merged":[]}
["Position","Number","Name","Club","Gender","Category","Time","Points"]
[1,235,"Robin Wood","Builth & District","M","M40","01:23:41",{"$f":"(2-(G2/L$10))*100","v":120.42537005927288}]
[2,242,"Samuel Gregory","MDC","M","M","01:23:43",{"$f":"(2-(G3/L$10))*100","v":120.39367333354463},null,"Number of runners","Position","Time (hr.min.sec)"]
[3,207,"Jez Brown","Buckley Runners","M","M40","01:24:43",119.44277156169767,null,{"$f":"COUNT(B2:B201)","v":57},{"$f":"K6+2","v":31},{"$f":"VLOOKUP(K4,A$2:G$201,7,FALSE)","v":"01:46:14"}]
[4,225,"Mark Palmer","Unattached","M","M50","01:26:11",118.04811562965544,null,"Was it an even field?",{"$f":"K6+1","v":30},{"$f":"VLOOKUP(K5,A$2:G$201,7,FALSE)","v":"01:46:00"}]
[5,220,"Nathan Brickman","Belper Harriers","M","M","01:27:22",116.9228818663032,null,{"$f":"ISEVEN(J4)","v":false},{"$f":"IF(J6 = TRUE,(J4/2),((J4+1)/2))","v":29},"01:45:56"]
[6,209,"Iwan Morton","Mynydd Du","M","M40","01:29:44",114.67241433959872,null,null,{"$f":"K6-1","v":28},"01:44:14"]
[7,236,"Mark Lunt","Westbury Harriers","M","M","01:32:23",112.15252464420425,null,null,{"$f":"K6-2","v":27},{"$f":"VLOOKUP(K8,A$2:G$201,7,FALSE)","v":"01:43:25"}]
[8,206,"Niki Radnedge","Unattached","M","M40","01:33:14",111.34425813813434,null,null,{"$f":"IF(J5 = TRUE, K6-3, \" \")","v":" "},{"$f":"VLOOKUP(K9,A7:G206,7,FALSE)","v":{"$error":"#N/A"}}]
[9,251,"Daniel Lewis","Wye Valley Runners","M","M40","01:33:25",111.16992614662907,null,null,null,{"$f":"IF(J6=TRUE,AVERAGE(L4:L9),AVERAGE(L4:L8))","v":"01:45:09.800"}]
[10,238,"Gavin Brace","Lliswerry Runners","M","M","01:33:50",110.77371707502617]
[11,212,"Andy Pritchard","Buckley Runners","M","M40","01:34:01",110.59938508352087]
[12,230,"Anthony Powell","Maldwyn Harriers","M","M40","01:34:44",109.91790548036388]
[13,214,"Patrick Tudor","Unattached","M","M","01:35:00",109.66433167453802]
[14,205,"Dave Robson","Ilkley Harriers","M","M40","01:35:33",109.1413357000222]
[15,246,"Helen Brown","Mynydd Du","F","F40","01:36:06",108.61833972550636]
[16,227,"Mark Nelson","Unattached","M","M40","01:36:21",108.3806142825446]
[17,210,"Hayley Evans","Buckley Runners","F","F","01:36:29",108.25382737963167]
[18,232,"Mike Johnson","Unattached","M","M50","01:36:47",107.9685568480776]
[19,241,"Matthew Lawson","Chepstow Harriers","M","M40","01:37:04",107.69913467938761]
{"$rows_left_out":43}
{"sheet":"Pen Y Fan","index":5,"n_rows":97,"n_cols":12,"rows_kept":97,"cut":false,"hidden":false,"merged":[]}
["Position","Number","Name","Club","Gender","Category","Time","Points"]
[1,"Unknown","Michael Corrales","North Wales Road Runners","M","M","00:36:23",{"$f":"(2-(G2/L$10))*100","v":128.29300339428448}]
[{"$f":"A2+1","v":2},"Unknown","Dan Doherty","Mynydd Du","M","M","00:36:32",{"$f":"(2-(G3/L$10))*100","v":127.99737216686742},null,"Number of runners","Position","Time (min.sec)"]
[{"$f":"A3+1","v":3},"Unknown","Samuel Bevan","Basingstoke & Mid Hants AC","M","M","00:37:35",125.92795357494802,null,{"$f":"COUNT(A2:A201)","v":96},{"$f":"K6+2","v":50},{"$f":"VLOOKUP(K4,A2:G201,7,FALSE)","v":"00:51:42"}]
[4,"Unknown","Billy Starling","Mercia Fell Runners","M","M","00:38:35",123.95707872550092,null,{"$f":"ISEVEN(J4)","v":true},{"$f":"K6+1","v":49},{"$f":"VLOOKUP(K5,A3:G202,7,FALSE)","v":"00:50:51"}]
[5,"Unknown","Jez Brown","Buckley Runners","M","M40","00:38:46",123.59575166976899,null,null,{"$f":"IF(J5 = TRUE,(J4/2),((J4+1)/2))","v":48},"00:50:50"]
[6,"Unknown","Jim Webb","Team Bath AC","M","M","00:39:46",121.6248768203219,null,null,{"$f":"K6-1","v":47},"00:50:39"]
[7,"Unknown","Andrew Reeves","Serpentine Running Club","M","M40","00:40:48",119.58830614255996,null,null,{"$f":"K6-2","v":46},"00:50:19"]
[8,"Unknown","David Lawson","MDC","M","M","00:41:56",117.35464797985328,null,null,{"$f":"IF(J5 = TRUE, K6-3, Na)","v":45},"00:50:05"]
[9,"Unknown","Hopcyn Matthews","Unattached","M","M","00:42:14",116.76338552501917,null,null,null,{"$f":"IF(J5=TRUE,AVERAGE(L4:L9),AVERAGE(L4:L8))","v":"00:50:44.333"}]
[10,"Unknown","Christian Poulton","Cambridge Harriers","M","M50","00:42:17",116.66484178254683]
[11,"Unknown","Llewelyn Lloyd","Sarn Helen","M","M","00:42:31",116.20497098434251]
[12,"Unknown","Joe Starling","Mercia Fell Runners","M","M","00:42:34",116.10642724187015]
[13,"Unknown","Mark Hopkinson","Unattached","M","M","00:42:38",115.97503558524033]
[14,"Unknown","Tarbo Fukazawa","Cambridge Harriers","M","M","00:43:00",115.25238147377644]
[15,"Unknown","Daniel Nettelfield","South Molton Strugglers","M","M","00:43:01",115.21953355961898]
[16,"Unknown","Thomas Mollekin","Mynydd Du","M","M","00:43:21",114.56257527646994]
[17,"Unknown","Mark Lunt","Westbury Harriers","M","M","00:43:32",114.20124822073801]
[18,"Unknown","Nick Biggs","Vegan Runners","M","M40","00:43:55",113.44574619511663]
[19,"Unknown","Anthony Powell","Maldwyn Harriers","M","M40","00:44:06",113.08441913938468]
{"$rows_left_out":78}
{"sheet":"Fan Brycheiniog","index":6,"n_rows":39,"n_cols":12,"rows_kept":39,"cut":false,"hidden":false,"merged":[]}
["Position","Number","Name","Club","Gender","Category","Time","Points"]
[1,349,"Dan Doherty","Mynydd Du","M","M","01:15:38.790",{"$f":"(2-(G2/L$10))*100","v":127.71704668244541}]
[{"$f":"A2+1","v":2},315,"Tom Mollekin","Mynydd Du","M","M","01:27:41.120",{"$f":"(2-(G3/L$10))*100","v":116.21350814687332},null,"Number of runners","Position","Time (min.sec)"]
[{"$f":"A3+1","v":3},314,"Alun Wood","Mynydd Du","M","M","01:30:27.780",113.55934767681333,null,{"$f":"COUNT(A2:A201)","v":38},{"$f":"K6+2","v":21},{"$f":"VLOOKUP(K4,A2:G201,7,FALSE)","v":"01:45:52.720"}]
[4,334,"Jez Brown","Buckley Runners","M","M40","01:31:49.400",112.25950021751716,null,{"$f":"ISEVEN(J4)","v":true},{"$f":"K6+1","v":20},"01:45:19.040"]
[5,346,"Alex Lewis","Neath Harriers","M","M","01:32:58.400",111.16063382825676,null,null,{"$f":"IF(J5 = TRUE,(J4/2),((J4+1)/2))","v":19},"01:44:21.260"]
[6,343,"Matthew Lawson","Chepstow Harriers","M","M40","01:36:04.710",108.1935353212552,null,null,{"$f":"K6-1","v":18},"01:44:18.590"]
[7,332,"Andy Creber","Chepstow Harriers","M","M50","01:36:21.590",107.92471119588249,null,null,{"$f":"K6-2","v":17},"01:44:10.980"]
[8,327,"Andy Pritchard","Buckley Runners","M","M40","01:36:28.200",107.8194429809113,null,null,{"$f":"IF(J5 = TRUE, K6-3, Na)","v":16},"01:43:52.600"]
[9,326,"Hayley Evans","Buckley Runners","F","F","01:36:33.910",107.72850780580005,null,null,null,{"$f":"IF(J5=TRUE,AVERAGE(L4:L9),AVERAGE(L4:L8))","v":"01:44:39.198"}]
[10,324,"Andy Vaudin","Unattached","M","M50","01:36:43.480",107.57609981528961]
[11,318,"Andy Horlick","Forest Of Dean Ac","M","M40","01:36:50.590",107.46286880039624]
[12,325,"Niki Morgan","Mynydd Du","F","F50","01:38:50.990",105.54542657913603]
[13,329,"Nick Dallimore","MDC","M","M60","01:39:24.160",105.01717443229883]
[14,330,"Rhian Probert","Mynydd Du","F","F40","01:39:49.440",104.61457526823357]
[15,333,"Pauline Linton","FRA","F","F50","01:43:21.530",101.23691479724455]
[16,313,"James Woodier","Mynydd Du","M","M","01:43:52.600",100.7421064100805]
[17,322,"Martin Carter","Hay Hotfooters","M","M50","01:44:10.980",100.44939388494126]
[18,344,"Sasha Habgood","MDC","F","F40","01:44:18.590",100.32820007012573]
[19,345,"Andy Stott","MDC","M","M50","01:44:21.260",100.28567871854131]
{"$rows_left_out":20}
{"sheet":"Llyn Y Fan","index":7,"n_rows":90,"n_cols":12,"rows_kept":90,"cut":false,"hidden":false,"merged":[]}
["Position","Number","Name","Club","Sex","Category","Time","Points",{"$f":"AVERAGE(G4:G8)","v":{"$error":"#DIV/0!"}}]
[1]
[{"$f":"A2+1","v":2},null,null,null,null,null,null,null,null,"Number of runners","Position","Time (min.sec)"]
[{"$f":"A3+1","v":3},null,null,null,null,null,null,null,null,{"$f":"COUNT(B2:B201)","v":0},{"$f":"K6+2","v":2},{"$f":"VLOOKUP(K4,A2:G201,7,FALSE)","v":"00:00:00"}]
[4,null,null,null,null,null,null,null,null,{"$f":"ISEVEN(J4)","v":true},{"$f":"K6+1","v":1},{"$error":"#N/A"}]
[5,null,null,null,null,null,null,null,null,null,{"$f":"IF(J5 = TRUE,(J4/2),((J4+1)/2))","v":0},{"$error":"#N/A"}]
[6,null,null,null,null,null,null,null,null,null,{"$f":"K6-1","v":-1},{"$error":"#N/A"}]
[7,null,null,null,null,null,null,null,null,null,{"$f":"K6-2","v":-2},{"$error":"#N/A"}]
[8,null,null,null,null,null,null,null,null,null,{"$f":"IF(J5 = TRUE, K6-3, Na)","v":-3},{"$error":"#N/A"}]
[9,null,null,null,null,null,null,null,null,null,null,{"$f":"IF(J5=TRUE,AVERAGE(L4:L9),AVERAGE(L4:L8))","v":{"$error":"#N/A"}}]
[10]
[11]
[12]
[13]
[14]
[15]
[16]
[17]
[18]
[19]
{"$rows_left_out":70}